BDBM50235152 CHEBI:4747::CHEMBL230128
SMILES: [H][C@@]12CC(C)(C)CC[C@@]1([C@H](O)C[C@]1(C)C2=CC[C@]2([H])[C@@]3(C)CC[C@H](O)C(C)(C)[C@]3([H])CC[C@@]12C)C(O)=O
InChI Key: InChIKey=YKOPWPOFWMYZJZ-PRIAQAIDSA-N
Data: 1 IC50
Activity Spreadsheet -- Enzyme Inhibition Constant Data from BindingDB
Found 1 hit for monomerid = 50235152
Trg + Lig
Ki
nM
ΔG°
kcal/mole
IC50
nM
Kd
nM
EC50/IC50
nM
koff
s-1
kon
M-1s-1
pHTemp
°C
Coagulation factor VII/tissue factor
(Homo sapiens (Human))
BDBM50235152
(CHEBI:4747 | CHEMBL230128)
Show SMILES [H][C@@]12CC(C)(C)CC[C@@]1([C@H](O)C[C@]1(C)C2=CC[C@]2([H])[C@@]3(C)CC[C@H](O)C(C)(C)[C@]3([H])CC[C@@]12C)C(O)=O |t:16|
Show InChI InChI=1S/C30H48O4/c1-25(2)14-15-30(24(33)34)19(16-25)18-8-9-21-27(5)12-11-22(31)26(3,4)20(27)10-13-28(21,6)29(18,7)17-23(30)32/h8,19-23,31-32H,9-17H2,1-7H3,(H,33,34)/t19-,20-,21+,22-,23+,27-,28+,29+,30+/m0/s1
Reactome pathway
n/an/a 0.0540n/an/an/an/an/an/a
China Pharmaceutical University
Curated by ChEMBL
Assay Description
Inhibition of LPS-induced tissue factor procoagulant activity in human THP1 cells preincubated for 1 hr followed by LPS addition measured after 5 hrs...
Bioorg Med Chem Lett 27: 1026-1030 (2017)
Article DOI: 10.1016/j.bmcl.2016.12.066
BindingDB Entry DOI: 10.7270/Q2B27XJD