BDBM50235197 CHEMBL4086237
SMILES: Cc1c2COC(=O)c2ccc1[C@@H](O)CN1CCC2(CN(C(=O)C2)c2cnc(cn2)S(C)(=O)=O)CC1
InChI Key: InChIKey=QZVBLNIFHQHIJS-IBGZPJMESA-N
Data: 6 IC50
Activity Spreadsheet -- Enzyme Inhibition Constant Data from BindingDB
Found 6 hits for monomerid = 50235197
Trg + Lig
Ki
nM
ΔG°
kcal/mole
IC50
nM
Kd
nM
EC50/IC50
nM
koff
s-1
kon
M-1s-1
pHTemp
°C
Renal Outer Medullary Potassium (ROMK)
(Rattus norvegicus (Rat))
BDBM50235197
(CHEMBL4086237)
Show SMILES Cc1c2COC(=O)c2ccc1[C@@H](O)CN1CCC2(CN(C(=O)C2)c2cnc(cn2)S(C)(=O)=O)CC1 |r|
Show InChI InChI=1S/C24H28N4O6S/c1-15-16(3-4-17-18(15)13-34-23(17)31)19(29)12-27-7-5-24(6-8-27)9-22(30)28(14-24)20-10-26-21(11-25-20)35(2,32)33/h3-4,10-11,19,29H,5-9,12-14H2,1-2H3/t19-/m0/s1
n/an/a 60n/an/an/an/an/an/a
Merck& Co. Inc.
Curated by ChEMBL
Assay Description
In vitro 100 nM cortex affinity to displace [3H]- -CD providing a measure of muscarinic m1 receptor agonist affinity
Bioorg Med Chem Lett 27: 1109-1114 (2017)
Article DOI: 10.1016/j.bmcl.2016.10.032
BindingDB Entry DOI: 10.7270/Q2T43WC8
ATP-sensitive inward rectifier potassium channel 1
(Homo sapiens (Human))
BDBM50235197
(CHEMBL4086237)
Show SMILES Cc1c2COC(=O)c2ccc1[C@@H](O)CN1CCC2(CN(C(=O)C2)c2cnc(cn2)S(C)(=O)=O)CC1 |r|
Show InChI InChI=1S/C24H28N4O6S/c1-15-16(3-4-17-18(15)13-34-23(17)31)19(29)12-27-7-5-24(6-8-27)9-22(30)28(14-24)20-10-26-21(11-25-20)35(2,32)33/h3-4,10-11,19,29H,5-9,12-14H2,1-2H3/t19-/m0/s1
Reactome pathway
n/an/a 34n/an/an/an/an/an/a
Merck& Co. Inc.
Curated by ChEMBL
Assay Description
Inhibition of human ROMK expressed in CHO cells by electrophysiology method
Bioorg Med Chem Lett 27: 1109-1114 (2017)
Article DOI: 10.1016/j.bmcl.2016.10.032
BindingDB Entry DOI: 10.7270/Q2T43WC8
ATP-regulated potassium channel ROMK
(Homo sapiens (Human))
BDBM50235197
(CHEMBL4086237)
Show SMILES Cc1c2COC(=O)c2ccc1[C@@H](O)CN1CCC2(CN(C(=O)C2)c2cnc(cn2)S(C)(=O)=O)CC1 |r|
Show InChI InChI=1S/C24H28N4O6S/c1-15-16(3-4-17-18(15)13-34-23(17)31)19(29)12-27-7-5-24(6-8-27)9-22(30)28(14-24)20-10-26-21(11-25-20)35(2,32)33/h3-4,10-11,19,29H,5-9,12-14H2,1-2H3/t19-/m0/s1
Reactome pathway
US Patent
n/an/a 74.2n/an/an/an/an/an/a
Merck Sharp & Dohme Corp.
US Patent
Assay Description
Assay Protocol: The ROMK channel functional thallium flux assay was performed in 384 wells, using the FLIPR-Tetra instrument. HEK-hKir1.1 cells were ...
US Patent US9751881 (2017)
BindingDB Entry DOI: 10.7270/Q26M38ZP
1,3-beta-glucan synthase component GLS2
(Saccharomyces cerevisiae)
BDBM50235197
(CHEMBL4086237)
Show SMILES Cc1c2COC(=O)c2ccc1[C@@H](O)CN1CCC2(CN(C(=O)C2)c2cnc(cn2)S(C)(=O)=O)CC1 |r|
Show InChI InChI=1S/C24H28N4O6S/c1-15-16(3-4-17-18(15)13-34-23(17)31)19(29)12-27-7-5-24(6-8-27)9-22(30)28(14-24)20-10-26-21(11-25-20)35(2,32)33/h3-4,10-11,19,29H,5-9,12-14H2,1-2H3/t19-/m0/s1
n/an/a 2.78E+4n/an/an/an/an/an/a
Merck& Co. Inc.
Curated by ChEMBL
Assay Description
Inhibition of human ERG by electrophysiology method
Bioorg Med Chem Lett 27: 1109-1114 (2017)
Article DOI: 10.1016/j.bmcl.2016.10.032
BindingDB Entry DOI: 10.7270/Q2T43WC8
1,3-beta-glucan synthase component GLS2
(Saccharomyces cerevisiae)
BDBM50235197
(CHEMBL4086237)
Show SMILES Cc1c2COC(=O)c2ccc1[C@@H](O)CN1CCC2(CN(C(=O)C2)c2cnc(cn2)S(C)(=O)=O)CC1 |r|
Show InChI InChI=1S/C24H28N4O6S/c1-15-16(3-4-17-18(15)13-34-23(17)31)19(29)12-27-7-5-24(6-8-27)9-22(30)28(14-24)20-10-26-21(11-25-20)35(2,32)33/h3-4,10-11,19,29H,5-9,12-14H2,1-2H3/t19-/m0/s1
n/an/a 1.61E+4n/an/an/an/an/an/a
Merck& Co. Inc.
Curated by ChEMBL
Assay Description
Displacement of [35S]MK499 from human ERG expressed in HEK293 cells
Bioorg Med Chem Lett 27: 1109-1114 (2017)
Article DOI: 10.1016/j.bmcl.2016.10.032
BindingDB Entry DOI: 10.7270/Q2T43WC8
ATP-sensitive inward rectifier potassium channel 1
(Homo sapiens (Human))
BDBM50235197
(CHEMBL4086237)
Show SMILES Cc1c2COC(=O)c2ccc1[C@@H](O)CN1CCC2(CN(C(=O)C2)c2cnc(cn2)S(C)(=O)=O)CC1 |r|
Show InChI InChI=1S/C24H28N4O6S/c1-15-16(3-4-17-18(15)13-34-23(17)31)19(29)12-27-7-5-24(6-8-27)9-22(30)28(14-24)20-10-26-21(11-25-20)35(2,32)33/h3-4,10-11,19,29H,5-9,12-14H2,1-2H3/t19-/m0/s1
Reactome pathway
n/an/a 74n/an/an/an/an/an/a
Merck& Co. Inc.
Curated by ChEMBL
Assay Description
Inhibition of human ROMK expressed in HEK293 cells after 30 mins by thallium flux assay
Bioorg Med Chem Lett 27: 1109-1114 (2017)
Article DOI: 10.1016/j.bmcl.2016.10.032
BindingDB Entry DOI: 10.7270/Q2T43WC8