null
SMILES: Cc1ccc(cc1Cl)-c1cc2c(NC(Cc3ccccc3)P(O)(O)=O)ncnc2s1
InChI Key: InChIKey=FHHLLOYGUMAOOP-UHFFFAOYSA-N
PDB links: 1 PDB ID matches this monomer.
Activity Spreadsheet -- Enzyme Inhibition Constant Data from BindingDB
Found 1 hit for monomerid = 50235462
Trg + Lig
Ki
nM
ΔG°
kcal/mole
IC50
nM
Kd
nM
EC50/IC50
nM
koff
s-1
kon
M-1s-1
pHTemp
°C
Farnesyl pyrophosphate synthase
(Homo sapiens (Human))
BDBM50235462
(CHEMBL4087424)
Show SMILES Cc1ccc(cc1Cl)-c1cc2c(NC(Cc3ccccc3)P(O)(O)=O)ncnc2s1
Show InChI InChI=1S/C21H19ClN3O3PS/c1-13-7-8-15(10-17(13)22)18-11-16-20(23-12-24-21(16)30-18)25-19(29(26,27)28)9-14-5-3-2-4-6-14/h2-8,10-12,19H,9H2,1H3,(H,23,24,25)(H2,26,27,28)
Reactome pathway
n/an/a 2.30E+3n/an/an/an/an/an/a
McGill University
Curated by ChEMBL
Assay Description
Inhibition of N-terminal His-tagged human recombinant FPPS expressed in Escherichia coli BL21 (DE3) using GPP and [3H]-IPP as substrate preincubated ...
J Med Chem 60: 2119-2134 (2017)
Article DOI: 10.1021/acs.jmedchem.6b01888
BindingDB Entry DOI: 10.7270/Q23F4RXR
3D
3D Structure (crystal)