BDBM50235535 CHEMBL559192::N-(4-carbamimidoyl-benzyl)-2-[4-methyl-2-oxo-1-(2-o-tolyl-ethylamino)-1,2-dihydro-pyridin-3-yl]-acetamide hydrochloride
SMILES: Cc1ccccc1CCNn1ccc(C)c(CC(=O)NCc2ccc(cc2)C(N)=N)c1=O
InChI Key: InChIKey=HDGYRHZYIBAYIA-UHFFFAOYSA-N
Data: 1 IC50
Activity Spreadsheet -- Enzyme Inhibition Constant Data from BindingDB
Found 1 hit for monomerid = 50235535
Trg + Lig
Ki
nM
ΔG°
kcal/mole
IC50
nM
Kd
nM
EC50/IC50
nM
koff
s-1
kon
M-1s-1
pHTemp
°C
Prothrombin
(Homo sapiens (Human))
BDBM50235535
(CHEMBL559192 | N-(4-carbamimidoyl-benzyl)-2-[4-met...)
Show SMILES Cc1ccccc1CCNn1ccc(C)c(CC(=O)NCc2ccc(cc2)C(N)=N)c1=O
Show InChI InChI=1S/C25H29N5O2/c1-17-5-3-4-6-20(17)11-13-29-30-14-12-18(2)22(25(30)32)15-23(31)28-16-19-7-9-21(10-8-19)24(26)27/h3-10,12,14,29H,11,13,15-16H2,1-2H3,(H3,26,27)(H,28,31)
n/an/a 23n/an/an/an/an/an/a
Universit£ de Montr£al
Curated by ChEMBL
Assay Description
Inhibition of thrombin
Bioorg Med Chem Lett 18: 1972-6 (2008)
Article DOI: 10.1016/j.bmcl.2008.01.122
BindingDB Entry DOI: 10.7270/Q2833SV0