BDBM50235579 CHEMBL4073025
SMILES: CC(C)CC(NS(=O)(=O)c1ccc(N)cc1)c1nc2ccccc2c(=O)n1-c1cccc(Cl)c1
InChI Key: InChIKey=NLVWRTBVNUKIMG-UHFFFAOYSA-N
Data: 1 IC50
Activity Spreadsheet -- Enzyme Inhibition Constant Data from BindingDB
Found 1 hit for monomerid = 50235579
Trg + Lig
Ki
nM
ΔG°
kcal/mole
IC50
nM
Kd
nM
EC50/IC50
nM
koff
s-1
kon
M-1s-1
pHTemp
°C
Dihydrofolate reductase
(Bos taurus (Cattle))
BDBM50235579
(CHEMBL4073025)
Show SMILES CC(C)CC(NS(=O)(=O)c1ccc(N)cc1)c1nc2ccccc2c(=O)n1-c1cccc(Cl)c1
Show InChI InChI=1S/C25H25ClN4O3S/c1-16(2)14-23(29-34(32,33)20-12-10-18(27)11-13-20)24-28-22-9-4-3-8-21(22)25(31)30(24)19-7-5-6-17(26)15-19/h3-13,15-16,23,29H,14,27H2,1-2H3
n/an/a 0.0360n/an/an/an/an/an/a
Affiliated to Sardar Patel University
Curated by ChEMBL
Assay Description
Inhibition of bovine liver DHFR using FH2 as substrate preincubated for 2 mins followed by substrate addition in presence of NADPH
Eur J Med Chem 129: 251-265 (2017)
Article DOI: 10.1016/j.ejmech.2017.02.012
BindingDB Entry DOI: 10.7270/Q2TX3HN7