BDBM50235582 CHEMBL4102361
SMILES: CC(C)CC(NS(=O)(=O)c1ccc(N)cc1)c1nc2ccccc2c(=O)n1-c1ccc(Br)cc1
InChI Key: InChIKey=BWAJJPVQHDUFDQ-UHFFFAOYSA-N
Data: 1 IC50
Activity Spreadsheet -- Enzyme Inhibition Constant Data from BindingDB
Found 1 hit for monomerid = 50235582
Trg + Lig
Ki
nM
ΔG°
kcal/mole
IC50
nM
Kd
nM
EC50/IC50
nM
koff
s-1
kon
M-1s-1
pHTemp
°C
Dihydrofolate reductase
(Bos taurus (Cattle))
BDBM50235582
(CHEMBL4102361)
Show SMILES CC(C)CC(NS(=O)(=O)c1ccc(N)cc1)c1nc2ccccc2c(=O)n1-c1ccc(Br)cc1
Show InChI InChI=1S/C25H25BrN4O3S/c1-16(2)15-23(29-34(32,33)20-13-9-18(27)10-14-20)24-28-22-6-4-3-5-21(22)25(31)30(24)19-11-7-17(26)8-12-19/h3-14,16,23,29H,15,27H2,1-2H3
n/an/a 0.0870n/an/an/an/an/an/a
Affiliated to Sardar Patel University
Curated by ChEMBL
Assay Description
Inhibition of bovine liver DHFR using FH2 as substrate preincubated for 2 mins followed by substrate addition in presence of NADPH
Eur J Med Chem 129: 251-265 (2017)
Article DOI: 10.1016/j.ejmech.2017.02.012
BindingDB Entry DOI: 10.7270/Q2TX3HN7