BDBM50235627 CHEMBL4095605
SMILES: CN(C)[C@H]1CN(Cc2c(F)cccc2Cl)C[C@@H]1c1cn(C)c2ccccc12
InChI Key: InChIKey=SGJDIPHHTWORQM-VGSWGCGISA-N
Data: 1 KI  2 IC50
Activity Spreadsheet -- Enzyme Inhibition Constant Data from BindingDB
Found 3 hits for monomerid = 50235627
Trg + Lig
Ki
nM
ΔG°
kcal/mole
IC50
nM
Kd
nM
EC50/IC50
nM
koff
s-1
kon
M-1s-1
pHTemp
°C
Polycomb protein EED (EED)
(Homo sapiens (Human))
BDBM50235627
(CHEMBL4095605)
Show SMILES CN(C)[C@H]1CN(Cc2c(F)cccc2Cl)C[C@@H]1c1cn(C)c2ccccc12 |r|
Show InChI InChI=1S/C22H25ClFN3/c1-25(2)22-14-27(13-18-19(23)8-6-9-20(18)24)12-17(22)16-11-26(3)21-10-5-4-7-15(16)21/h4-11,17,22H,12-14H2,1-3H3/t17-,22+/m1/s1
53n/an/an/an/an/an/an/an/a
AbbVie Inc.
Curated by ChEMBL
Assay Description
Inhibition of OG(488) labeled probe binding to GST-tagged EED (unknown origin) after 1 hr by LanthaScreen TR-FRET assay
Bioorg Med Chem Lett 27: 1576-1583 (2017)
Article DOI: 10.1016/j.bmcl.2017.02.030
BindingDB Entry DOI: 10.7270/Q22F7QQG
Polycomb protein EED (EED)
(Homo sapiens (Human))
BDBM50235627
(CHEMBL4095605)
Show SMILES CN(C)[C@H]1CN(Cc2c(F)cccc2Cl)C[C@@H]1c1cn(C)c2ccccc12 |r|
Show InChI InChI=1S/C22H25ClFN3/c1-25(2)22-14-27(13-18-19(23)8-6-9-20(18)24)12-17(22)16-11-26(3)21-10-5-4-7-15(16)21/h4-11,17,22H,12-14H2,1-3H3/t17-,22+/m1/s1
n/an/a 6.90E+3n/an/an/an/an/an/a
AbbVie Inc.
Curated by ChEMBL
Assay Description
In vitro test for inhibitory activity against human dipeptidyl peptidase IV.
Bioorg Med Chem Lett 27: 1576-1583 (2017)
Article DOI: 10.1016/j.bmcl.2017.02.030
BindingDB Entry DOI: 10.7270/Q22F7QQG
Polycomb protein EED (EED)
(Homo sapiens (Human))
BDBM50235627
(CHEMBL4095605)
Show SMILES CN(C)[C@H]1CN(Cc2c(F)cccc2Cl)C[C@@H]1c1cn(C)c2ccccc12 |r|
Show InChI InChI=1S/C22H25ClFN3/c1-25(2)22-14-27(13-18-19(23)8-6-9-20(18)24)12-17(22)16-11-26(3)21-10-5-4-7-15(16)21/h4-11,17,22H,12-14H2,1-3H3/t17-,22+/m1/s1
n/an/a>1.00E+4n/an/an/an/an/an/a
AbbVie Inc.
Curated by ChEMBL
Assay Description
Inhibition of EED in human OCILY19 cells assessed as reduction in H3K27 trymethylation measured after 6 days by alphaLISA method
Bioorg Med Chem Lett 27: 1576-1583 (2017)
Article DOI: 10.1016/j.bmcl.2017.02.030
BindingDB Entry DOI: 10.7270/Q22F7QQG