BDBM50236008 CHEMBL4065278
SMILES: CN(C)Cc1ccc(cc1)-c1cc(C#N)c(NCc2ccc(F)s2)n2cnnc12
InChI Key: InChIKey=RCHWCMMUDTZGEG-UHFFFAOYSA-N
Data: 1 IC50
Activity Spreadsheet -- Enzyme Inhibition Constant Data from BindingDB
Found 1 hit for monomerid = 50236008
Trg + Lig
Ki
nM
ΔG°
kcal/mole
IC50
nM
Kd
nM
EC50/IC50
nM
koff
s-1
kon
M-1s-1
pHTemp
°C
Polycomb protein EED
(Homo sapiens (Human))
BDBM50236008
(CHEMBL4065278)
Show SMILES CN(C)Cc1ccc(cc1)-c1cc(C#N)c(NCc2ccc(F)s2)n2cnnc12
Show InChI InChI=1S/C21H19FN6S/c1-27(2)12-14-3-5-15(6-4-14)18-9-16(10-23)20(28-13-25-26-21(18)28)24-11-17-7-8-19(22)29-17/h3-9,13,24H,11-12H2,1-2H3
n/an/a 510n/an/an/an/an/an/a
Novartis Institutes for BioMedical Research
Curated by ChEMBL
Assay Description
Binding affinity was determined against hPR-A (human progesterone receptor) using progesterone radioligand in competitive binding assay
J Med Chem 60: 2215-2226 (2017)
Article DOI: 10.1021/acs.jmedchem.6b01576
BindingDB Entry DOI: 10.7270/Q20G3NDT