BDBM50236011 CHEMBL4086716
SMILES: CN(C)Cc1ccc(cc1)-c1cnc(NCc2ccno2)n2cnnc12
InChI Key: InChIKey=PWJIZKDLOOAPHV-UHFFFAOYSA-N
Data: 1 IC50
Activity Spreadsheet -- Enzyme Inhibition Constant Data from BindingDB
Found 1 hit for monomerid = 50236011
Trg + Lig
Ki
nM
ΔG°
kcal/mole
IC50
nM
Kd
nM
EC50/IC50
nM
koff
s-1
kon
M-1s-1
pHTemp
°C
Polycomb protein EED
(Homo sapiens (Human))
BDBM50236011
(CHEMBL4086716)
Show SMILES CN(C)Cc1ccc(cc1)-c1cnc(NCc2ccno2)n2cnnc12
Show InChI InChI=1S/C18H19N7O/c1-24(2)11-13-3-5-14(6-4-13)16-10-20-18(25-12-21-23-17(16)25)19-9-15-7-8-22-26-15/h3-8,10,12H,9,11H2,1-2H3,(H,19,20)
n/an/a 130n/an/an/an/an/an/a
Novartis Institutes for BioMedical Research
Curated by ChEMBL
Assay Description
Inhibition of recombinant N-terminal GST-tagged EED (76 to 441 residues) (unknown origin) expressed in Escherichia coli BL21-CodonPlus(DE3)-RIL asses...
J Med Chem 60: 2215-2226 (2017)
Article DOI: 10.1021/acs.jmedchem.6b01576
BindingDB Entry DOI: 10.7270/Q20G3NDT