BDBM50236021 CHEMBL4064552
SMILES: CN(C)Cc1ccc(cc1)-c1cc(C#N)c(NCc2sccc2Cl)n2cnnc12
InChI Key: InChIKey=UUYKTQMOXKPELI-UHFFFAOYSA-N
Data: 1 IC50
Activity Spreadsheet -- Enzyme Inhibition Constant Data from BindingDB
Found 1 hit for monomerid = 50236021
Trg + Lig
Ki
nM
ΔG°
kcal/mole
IC50
nM
Kd
nM
EC50/IC50
nM
koff
s-1
kon
M-1s-1
pHTemp
°C
EZH2/SUZ12/EED/RBBP7/RBBP4
(Homo sapiens (Human))
BDBM50236021
(CHEMBL4064552)
Show SMILES CN(C)Cc1ccc(cc1)-c1cc(C#N)c(NCc2sccc2Cl)n2cnnc12
Show InChI InChI=1S/C21H19ClN6S/c1-27(2)12-14-3-5-15(6-4-14)17-9-16(10-23)20(28-13-25-26-21(17)28)24-11-19-18(22)7-8-29-19/h3-9,13,24H,11-12H2,1-2H3
n/an/a 2.34E+3n/an/an/an/an/an/a
Novartis Institutes for BioMedical Research
Curated by ChEMBL
Assay Description
Inhibition of recombinant N-terminal GST-tagged EED (76 to 441 residues) (unknown origin) expressed in Escherichia coli BL21-CodonPlus(DE3)-RIL asses...
J Med Chem 60: 2215-2226 (2017)
Article DOI: 10.1021/acs.jmedchem.6b01576
BindingDB Entry DOI: 10.7270/Q20G3NDT