BDBM50236198 CHEMBL4073105
SMILES: CC[C@H](C)[C@@H]1NC(=O)[C@@H]2CSSC[C@H](NC(=O)[C@H](CCCNC(N)=N)NC(=O)[C@@H]3CSSC[C@H](NC1=O)C(=O)N[C@@H]([C@@H](C)O)C(=O)N[C@@H](CCCNC(N)=N)C(=O)NCC(=O)N[C@@H](Cc1ccccc1)C(=O)N3)C(=O)N[C@@H](CC(C)C)C(=O)N[C@H]1CSSC[C@H](NC(=O)[C@@H](NC(=O)CNC(=O)[C@H](CCCNC(N)=N)NC(=O)[C@H](CCCNC(N)=N)NC1=O)C(C)C)C(=O)N[C@@H](CCCNC(N)=N)C(=O)N2
InChI Key: InChIKey=BEOLWJVNPROZQJ-AQSKNYQYSA-N
Data: 1 KI  3 IC50
Activity Spreadsheet -- Enzyme Inhibition Constant Data from BindingDB
Found 4 hits for monomerid = 50236198
Trg + Lig
Ki
nM
ΔG°
kcal/mole
IC50
nM
Kd
nM
EC50/IC50
nM
koff
s-1
kon
M-1s-1
pHTemp
°C
Antrax lethal toxin
(Bacillus anthracis)
BDBM50236198
(CHEMBL4073105)
Show SMILES CC[C@H](C)[C@@H]1NC(=O)[C@@H]2CSSC[C@H](NC(=O)[C@H](CCCNC(N)=N)NC(=O)[C@@H]3CSSC[C@H](NC1=O)C(=O)N[C@@H]([C@@H](C)O)C(=O)N[C@@H](CCCNC(N)=N)C(=O)NCC(=O)N[C@@H](Cc1ccccc1)C(=O)N3)C(=O)N[C@@H](CC(C)C)C(=O)N[C@H]1CSSC[C@H](NC(=O)[C@@H](NC(=O)CNC(=O)[C@H](CCCNC(N)=N)NC(=O)[C@H](CCCNC(N)=N)NC1=O)C(C)C)C(=O)N[C@@H](CCCNC(N)=N)C(=O)N2 |r|
Show InChI InChI=1S/C82H137N33O19S6/c1-8-41(6)60-76(133)112-56-38-140-136-34-52(110-68(125)50(30-43-17-10-9-11-18-43)100-57(117)31-98-63(120)45(20-13-25-94-79(85)86)105-77(134)61(42(7)116)115-74(56)131)70(127)103-47(22-15-27-96-81(89)90)65(122)107-53-35-137-139-37-55(73(130)114-60)108-66(123)48(23-16-28-97-82(91)92)104-71(128)54-36-138-135-33-51(109-67(124)49(29-39(2)3)106-72(53)129)69(126)102-46(21-14-26-95-80(87)88)64(121)101-44(19-12-24-93-78(83)84)62(119)99-32-58(118)113-59(40(4)5)75(132)111-54/h9-11,17-18,39-42,44-56,59-61,116H,8,12-16,19-38H2,1-7H3,(H,98,120)(H,99,119)(H,100,117)(H,101,121)(H,102,126)(H,103,127)(H,104,128)(H,105,134)(H,106,129)(H,107,122)(H,108,123)(H,109,124)(H,110,125)(H,111,132)(H,112,133)(H,113,118)(H,114,130)(H,115,131)(H4,83,84,93)(H4,85,86,94)(H4,87,88,95)(H4,89,90,96)(H4,91,92,97)/t41-,42+,44-,45-,46-,47-,48-,49-,50-,51-,52-,53-,54-,55-,56-,59-,60-,61-/m0/s1
NCI pathway
Reactome pathway
365n/an/an/an/an/an/an/an/a
State University of New York
Curated by ChEMBL
Assay Description
Inhibition of Bacillus anthracis lethal factor protease preincubated for 30 mins prior to addition of substrate containing fluorescent proteins CyPet...
J Med Chem 60: 1916-1927 (2017)
Article DOI: 10.1021/acs.jmedchem.6b01689
BindingDB Entry DOI: 10.7270/Q2377C05
Antrax lethal toxin
(Bacillus anthracis)
BDBM50236198
(CHEMBL4073105)
Show SMILES CC[C@H](C)[C@@H]1NC(=O)[C@@H]2CSSC[C@H](NC(=O)[C@H](CCCNC(N)=N)NC(=O)[C@@H]3CSSC[C@H](NC1=O)C(=O)N[C@@H]([C@@H](C)O)C(=O)N[C@@H](CCCNC(N)=N)C(=O)NCC(=O)N[C@@H](Cc1ccccc1)C(=O)N3)C(=O)N[C@@H](CC(C)C)C(=O)N[C@H]1CSSC[C@H](NC(=O)[C@@H](NC(=O)CNC(=O)[C@H](CCCNC(N)=N)NC(=O)[C@H](CCCNC(N)=N)NC1=O)C(C)C)C(=O)N[C@@H](CCCNC(N)=N)C(=O)N2 |r|
Show InChI InChI=1S/C82H137N33O19S6/c1-8-41(6)60-76(133)112-56-38-140-136-34-52(110-68(125)50(30-43-17-10-9-11-18-43)100-57(117)31-98-63(120)45(20-13-25-94-79(85)86)105-77(134)61(42(7)116)115-74(56)131)70(127)103-47(22-15-27-96-81(89)90)65(122)107-53-35-137-139-37-55(73(130)114-60)108-66(123)48(23-16-28-97-82(91)92)104-71(128)54-36-138-135-33-51(109-67(124)49(29-39(2)3)106-72(53)129)69(126)102-46(21-14-26-95-80(87)88)64(121)101-44(19-12-24-93-78(83)84)62(119)99-32-58(118)113-59(40(4)5)75(132)111-54/h9-11,17-18,39-42,44-56,59-61,116H,8,12-16,19-38H2,1-7H3,(H,98,120)(H,99,119)(H,100,117)(H,101,121)(H,102,126)(H,103,127)(H,104,128)(H,105,134)(H,106,129)(H,107,122)(H,108,123)(H,109,124)(H,110,125)(H,111,132)(H,112,133)(H,113,118)(H,114,130)(H,115,131)(H4,83,84,93)(H4,85,86,94)(H4,87,88,95)(H4,89,90,96)(H4,91,92,97)/t41-,42+,44-,45-,46-,47-,48-,49-,50-,51-,52-,53-,54-,55-,56-,59-,60-,61-/m0/s1
NCI pathway
Reactome pathway
n/an/a 390n/an/an/an/an/an/a
State University of New York
Curated by ChEMBL
Assay Description
Inhibition of Bacillus anthracis lethal factor protease preincubated for 30 mins prior to addition of substrate containing fluorescent proteins CyPet...
J Med Chem 60: 1916-1927 (2017)
Article DOI: 10.1021/acs.jmedchem.6b01689
BindingDB Entry DOI: 10.7270/Q2377C05
Antrax lethal toxin
(Bacillus anthracis)
BDBM50236198
(CHEMBL4073105)
Show SMILES CC[C@H](C)[C@@H]1NC(=O)[C@@H]2CSSC[C@H](NC(=O)[C@H](CCCNC(N)=N)NC(=O)[C@@H]3CSSC[C@H](NC1=O)C(=O)N[C@@H]([C@@H](C)O)C(=O)N[C@@H](CCCNC(N)=N)C(=O)NCC(=O)N[C@@H](Cc1ccccc1)C(=O)N3)C(=O)N[C@@H](CC(C)C)C(=O)N[C@H]1CSSC[C@H](NC(=O)[C@@H](NC(=O)CNC(=O)[C@H](CCCNC(N)=N)NC(=O)[C@H](CCCNC(N)=N)NC1=O)C(C)C)C(=O)N[C@@H](CCCNC(N)=N)C(=O)N2 |r|
Show InChI InChI=1S/C82H137N33O19S6/c1-8-41(6)60-76(133)112-56-38-140-136-34-52(110-68(125)50(30-43-17-10-9-11-18-43)100-57(117)31-98-63(120)45(20-13-25-94-79(85)86)105-77(134)61(42(7)116)115-74(56)131)70(127)103-47(22-15-27-96-81(89)90)65(122)107-53-35-137-139-37-55(73(130)114-60)108-66(123)48(23-16-28-97-82(91)92)104-71(128)54-36-138-135-33-51(109-67(124)49(29-39(2)3)106-72(53)129)69(126)102-46(21-14-26-95-80(87)88)64(121)101-44(19-12-24-93-78(83)84)62(119)99-32-58(118)113-59(40(4)5)75(132)111-54/h9-11,17-18,39-42,44-56,59-61,116H,8,12-16,19-38H2,1-7H3,(H,98,120)(H,99,119)(H,100,117)(H,101,121)(H,102,126)(H,103,127)(H,104,128)(H,105,134)(H,106,129)(H,107,122)(H,108,123)(H,109,124)(H,110,125)(H,111,132)(H,112,133)(H,113,118)(H,114,130)(H,115,131)(H4,83,84,93)(H4,85,86,94)(H4,87,88,95)(H4,89,90,96)(H4,91,92,97)/t41-,42+,44-,45-,46-,47-,48-,49-,50-,51-,52-,53-,54-,55-,56-,59-,60-,61-/m0/s1
NCI pathway
Reactome pathway
n/an/a 1.06E+3n/an/an/an/an/an/a
State University of New York
Curated by ChEMBL
Assay Description
Inhibition of Bacillus anthracis lethal factor protease preincubated for 30 mins prior to addition of substrate containing fluorescent proteins CyPet...
J Med Chem 60: 1916-1927 (2017)
Article DOI: 10.1021/acs.jmedchem.6b01689
BindingDB Entry DOI: 10.7270/Q2377C05
Disintegrin and metalloproteinase domain-containing protein 17
(Homo sapiens (Human))
BDBM50236198
(CHEMBL4073105)
Show SMILES CC[C@H](C)[C@@H]1NC(=O)[C@@H]2CSSC[C@H](NC(=O)[C@H](CCCNC(N)=N)NC(=O)[C@@H]3CSSC[C@H](NC1=O)C(=O)N[C@@H]([C@@H](C)O)C(=O)N[C@@H](CCCNC(N)=N)C(=O)NCC(=O)N[C@@H](Cc1ccccc1)C(=O)N3)C(=O)N[C@@H](CC(C)C)C(=O)N[C@H]1CSSC[C@H](NC(=O)[C@@H](NC(=O)CNC(=O)[C@H](CCCNC(N)=N)NC(=O)[C@H](CCCNC(N)=N)NC1=O)C(C)C)C(=O)N[C@@H](CCCNC(N)=N)C(=O)N2 |r|
Show InChI InChI=1S/C82H137N33O19S6/c1-8-41(6)60-76(133)112-56-38-140-136-34-52(110-68(125)50(30-43-17-10-9-11-18-43)100-57(117)31-98-63(120)45(20-13-25-94-79(85)86)105-77(134)61(42(7)116)115-74(56)131)70(127)103-47(22-15-27-96-81(89)90)65(122)107-53-35-137-139-37-55(73(130)114-60)108-66(123)48(23-16-28-97-82(91)92)104-71(128)54-36-138-135-33-51(109-67(124)49(29-39(2)3)106-72(53)129)69(126)102-46(21-14-26-95-80(87)88)64(121)101-44(19-12-24-93-78(83)84)62(119)99-32-58(118)113-59(40(4)5)75(132)111-54/h9-11,17-18,39-42,44-56,59-61,116H,8,12-16,19-38H2,1-7H3,(H,98,120)(H,99,119)(H,100,117)(H,101,121)(H,102,126)(H,103,127)(H,104,128)(H,105,134)(H,106,129)(H,107,122)(H,108,123)(H,109,124)(H,110,125)(H,111,132)(H,112,133)(H,113,118)(H,114,130)(H,115,131)(H4,83,84,93)(H4,85,86,94)(H4,87,88,95)(H4,89,90,96)(H4,91,92,97)/t41-,42+,44-,45-,46-,47-,48-,49-,50-,51-,52-,53-,54-,55-,56-,59-,60-,61-/m0/s1
Reactome pathway
n/an/a 4.45E+3n/an/an/an/an/an/a
State University of New York
Curated by ChEMBL
Assay Description
Inhibition of recombinant human TACE extracellular domain (215 to 671 residues) assessed as inhibition of proteolytic activity preincubated for 30 mi...
J Med Chem 60: 1916-1927 (2017)
Article DOI: 10.1021/acs.jmedchem.6b01689
BindingDB Entry DOI: 10.7270/Q2377C05