BDBM50236260 7-[(1E)-1-(hydroxyimino)ethyl]-19-methyl-3,13,19,20-tetraazahexacyclo[14.7.0.0^{2,10}.0^{4,9}.0^{11,15}.0^{17,21}]tricosa-1(16),2(10),4,6,8,11(15),17,20-octaen-14-one::CHEMBL404322
SMILES: CC(N=O)c1ccc2[nH]c3c4CCc5nn(C)cc5-c4c4C(=O)NCc4c3c2c1
InChI Key: InChIKey=AJCUOYPNGRYALV-UHFFFAOYSA-N
Data: 2 IC50
Activity Spreadsheet -- Enzyme Inhibition Constant Data from BindingDB
Found 2 hits for monomerid = 50236260
Trg + Lig
Ki
nM
ΔG°
kcal/mole
IC50
nM
Kd
nM
EC50/IC50
nM
koff
s-1
kon
M-1s-1
pHTemp
°C
Vascular endothelial growth factor receptor 2
(Homo sapiens (Human))
BDBM50236260
(7-[(1E)-1-(hydroxyimino)ethyl]-19-methyl-3,13,19,2...)
Show SMILES CC(N=O)c1ccc2[nH]c3c4CCc5nn(C)cc5-c4c4C(=O)NCc4c3c2c1
Show InChI InChI=1S/C22H19N5O2/c1-10(26-29)11-3-5-16-13(7-11)19-14-8-23-22(28)20(14)18-12(21(19)24-16)4-6-17-15(18)9-27(2)25-17/h3,5,7,9-10,24H,4,6,8H2,1-2H3,(H,23,28)
NCI pathway
Reactome pathway
n/an/a 1n/an/an/an/an/an/a
Cephalon, Inc.
Curated by ChEMBL
Assay Description
Inhibition of human recombinant VEGFR2 by HTRF assay
Bioorg Med Chem Lett 18: 1916-21 (2008)
Article DOI: 10.1016/j.bmcl.2008.02.001
BindingDB Entry DOI: 10.7270/Q27M07PV
Angiopoietin-1 receptor
(Homo sapiens (Human))
BDBM50236260
(7-[(1E)-1-(hydroxyimino)ethyl]-19-methyl-3,13,19,2...)
Show SMILES CC(N=O)c1ccc2[nH]c3c4CCc5nn(C)cc5-c4c4C(=O)NCc4c3c2c1
Show InChI InChI=1S/C22H19N5O2/c1-10(26-29)11-3-5-16-13(7-11)19-14-8-23-22(28)20(14)18-12(21(19)24-16)4-6-17-15(18)9-27(2)25-17/h3,5,7,9-10,24H,4,6,8H2,1-2H3,(H,23,28)
n/an/a 44n/an/an/an/an/an/a
Cephalon, Inc.
Curated by ChEMBL
Assay Description
Inhibition of human recombinant TIE2 by HTRF assay
Bioorg Med Chem Lett 18: 1916-21 (2008)
Article DOI: 10.1016/j.bmcl.2008.02.001
BindingDB Entry DOI: 10.7270/Q27M07PV