BDBM50236275 CHEMBL4081851
SMILES: Cc1cc(C2CN(CC(F)(F)C2)C(=O)c2ccc(F)c(Br)c2)n2ncnc2n1
InChI Key: InChIKey=TTWAYHJJEHLVNR-UHFFFAOYSA-N
Data: 1 IC50
PDB links: 2 PDB IDs match this monomer.
Activity Spreadsheet -- Enzyme Inhibition Constant Data from BindingDB
Found 1 hit for monomerid = 50236275
Trg + Lig
Ki
nM
ΔG°
kcal/mole
IC50
nM
Kd
nM
EC50/IC50
nM
koff
s-1
kon
M-1s-1
pHTemp
°C
Homo sapiens phosphodiesterase 2A (PDE2A)
(Homo sapiens (Human))
BDBM50236275
(CHEMBL4081851)
Show SMILES Cc1cc(C2CN(CC(F)(F)C2)C(=O)c2ccc(F)c(Br)c2)n2ncnc2n1
Show InChI InChI=1S/C18H15BrF3N5O/c1-10-4-15(27-17(25-10)23-9-24-27)12-6-18(21,22)8-26(7-12)16(28)11-2-3-14(20)13(19)5-11/h2-5,9,12H,6-8H2,1H3
n/an/a 14n/an/an/an/an/an/a
Dart Neuroscience LLC
Curated by ChEMBL
Assay Description
Inhibition of human full length GST-tagged PDE2a using FAM-labeled cAMP as substrate preincubated for 5 mins followed by substrate addition measured ...
J Med Chem 60: 2037-2051 (2017)
Article DOI: 10.1021/acs.jmedchem.6b01793
BindingDB Entry DOI: 10.7270/Q2Q242GF
3D
3D Structure (crystal)