BDBM50236306 1-(2-(5-cyano-2-(4-fluorophenyl)-1H-indol-3-yl)ethyl)-3-(4-fluorophenylsulfonyl)urea::CHEMBL254774
SMILES: Fc1ccc(cc1)-c1[nH]c2ccc(cc2c1CCNC(=O)NS(=O)(=O)c1ccc(F)cc1)C#N
InChI Key: InChIKey=MRJFDMXTGXVYKU-UHFFFAOYSA-N
Data: 1 IC50
Activity Spreadsheet -- Enzyme Inhibition Constant Data from BindingDB
Found 1 hit for monomerid = 50236306
Trg + Lig
Ki
nM
ΔG°
kcal/mole
IC50
nM
Kd
nM
EC50/IC50
nM
koff
s-1
kon
M-1s-1
pHTemp
°C
C-X-C chemokine receptor type 2
(Homo sapiens (Human))
BDBM50236306
(1-(2-(5-cyano-2-(4-fluorophenyl)-1H-indol-3-yl)eth...)
Show SMILES Fc1ccc(cc1)-c1[nH]c2ccc(cc2c1CCNC(=O)NS(=O)(=O)c1ccc(F)cc1)C#N
Show InChI InChI=1S/C24H18F2N4O3S/c25-17-4-2-16(3-5-17)23-20(21-13-15(14-27)1-10-22(21)29-23)11-12-28-24(31)30-34(32,33)19-8-6-18(26)7-9-19/h1-10,13,29H,11-12H2,(H2,28,30,31)
Reactome pathway
n/an/a 520n/an/an/an/an/an/a
Johnson& Johnson Pharmaceutical Research and Development
Curated by ChEMBL
Assay Description
Displacement of europium labeled-human IL8 from human cloned CXCR2 expressed in Sf9 membrane with Galphai3-beta-1-gamma-2 by DELFIA binding assay
Bioorg Med Chem Lett 18: 1926-30 (2008)
Article DOI: 10.1016/j.bmcl.2008.01.127
BindingDB Entry DOI: 10.7270/Q20P10V3