BDBM50236451 CHEMBL4080514
SMILES: COCc1cccc(NC(=O)c2cc3sccc3n2C)c1COc1ccc(OC2CCCNCC2)cc1
InChI Key: InChIKey=KEXPXBUNMVXDSV-UHFFFAOYSA-N
Data: 1 IC50
Activity Spreadsheet -- Enzyme Inhibition Constant Data from BindingDB
Found 1 hit for monomerid = 50236451
Trg + Lig
Ki
nM
ΔG°
kcal/mole
IC50
nM
Kd
nM
EC50/IC50
nM
koff
s-1
kon
M-1s-1
pHTemp
°C
LSD1/CoREST complex
(Homo sapiens (Human))
BDBM50236451
(CHEMBL4080514)
Show SMILES COCc1cccc(NC(=O)c2cc3sccc3n2C)c1COc1ccc(OC2CCCNCC2)cc1
Show InChI InChI=1S/C29H33N3O4S/c1-32-26-13-16-37-28(26)17-27(32)29(33)31-25-7-3-5-20(18-34-2)24(25)19-35-21-8-10-23(11-9-21)36-22-6-4-14-30-15-12-22/h3,5,7-11,13,16-17,22,30H,4,6,12,14-15,18-19H2,1-2H3,(H,31,33)
n/an/a 29n/an/an/an/an/an/a
European Institute of Oncology
Curated by ChEMBL
Assay Description
Inhibition of recombinant human KDM1A/CoREST complex expressed in Escherichia coli using [Lys(Me1)4]-Histone H3 (1 to 21 residues)-GGK(biotin) as sub...
J Med Chem 60: 1693-1715 (2017)
Article DOI: 10.1021/acs.jmedchem.6b01019
BindingDB Entry DOI: 10.7270/Q22809VX