BDBM50236462 CHEMBL4091932
SMILES: Cn1c(cc2sccc12)C(=O)Nc1ccccc1COc1ccc(OCC2CCNCC2)cc1
InChI Key: InChIKey=IXTMQEOBSRZRFS-UHFFFAOYSA-N
Data: 1 IC50
Activity Spreadsheet -- Enzyme Inhibition Constant Data from BindingDB
Found 1 hit for monomerid = 50236462
Trg + Lig
Ki
nM
ΔG°
kcal/mole
IC50
nM
Kd
nM
EC50/IC50
nM
koff
s-1
kon
M-1s-1
pHTemp
°C
LSD1/CoREST complex
(Homo sapiens (Human))
BDBM50236462
(CHEMBL4091932)
Show SMILES Cn1c(cc2sccc12)C(=O)Nc1ccccc1COc1ccc(OCC2CCNCC2)cc1
Show InChI InChI=1S/C27H29N3O3S/c1-30-24-12-15-34-26(24)16-25(30)27(31)29-23-5-3-2-4-20(23)18-33-22-8-6-21(7-9-22)32-17-19-10-13-28-14-11-19/h2-9,12,15-16,19,28H,10-11,13-14,17-18H2,1H3,(H,29,31)
n/an/a 149n/an/an/an/an/an/a
European Institute of Oncology
Curated by ChEMBL
Assay Description
Inhibition of recombinant human KDM1A/CoREST complex expressed in Escherichia coli using [Lys(Me1)4]-Histone H3 (1 to 21 residues)-GGK(biotin) as sub...
J Med Chem 60: 1693-1715 (2017)
Article DOI: 10.1021/acs.jmedchem.6b01019
BindingDB Entry DOI: 10.7270/Q22809VX