BDBM50236540 CHEMBL4080994
SMILES: Oc1ccc(NC(=O)c2cnc3[nH]cc(-c4ccc(O)cc4)c3c2)cc1
InChI Key: InChIKey=BUDHBLBYISRDCR-UHFFFAOYSA-N
Data: 3 IC50  1 EC50
Activity Spreadsheet -- Enzyme Inhibition Constant Data from BindingDB
Found 4 hits for monomerid = 50236540
Trg + Lig
Ki
nM
ΔG°
kcal/mole
IC50
nM
Kd
nM
EC50/IC50
nM
koff
s-1
kon
M-1s-1
pHTemp
°C
Dual-specificity tyrosine-phosphorylation regulated kinase 1A
(Homo sapiens (Human))
BDBM50236540
(CHEMBL4080994)
Show SMILES Oc1ccc(NC(=O)c2cnc3[nH]cc(-c4ccc(O)cc4)c3c2)cc1
Show InChI InChI=1S/C20H15N3O3/c24-15-5-1-12(2-6-15)18-11-22-19-17(18)9-13(10-21-19)20(26)23-14-3-7-16(25)8-4-14/h1-11,24-25H,(H,21,22)(H,23,26)
Reactome pathway
n/an/a 344n/an/an/an/an/an/a
QIMR Berghofer Medical Research Institute
Curated by ChEMBL
Assay Description
Inhibition of DYRK1A (unknown origin) using woodtide as substrate after 10 mins in presence of [gamma-33P]ATP by microbeta scintillation counting
J Med Chem 60: 2052-2070 (2017)
Article DOI: 10.1021/acs.jmedchem.6b01840
BindingDB Entry DOI: 10.7270/Q2ST7S3J
Dual specificity tyrosine-phosphorylation-regulated kinase 1B
(Homo sapiens (Human))
BDBM50236540
(CHEMBL4080994)
Show SMILES Oc1ccc(NC(=O)c2cnc3[nH]cc(-c4ccc(O)cc4)c3c2)cc1
Show InChI InChI=1S/C20H15N3O3/c24-15-5-1-12(2-6-15)18-11-22-19-17(18)9-13(10-21-19)20(26)23-14-3-7-16(25)8-4-14/h1-11,24-25H,(H,21,22)(H,23,26)
n/an/a 128n/an/an/an/an/an/a
QIMR Berghofer Medical Research Institute
Curated by ChEMBL
Assay Description
Inhibition of DYRK1B (unknown origin) using woodtide as substrate after 40 mins in presence of [gamma-33P]ATP by microbeta scintillation counting
J Med Chem 60: 2052-2070 (2017)
Article DOI: 10.1021/acs.jmedchem.6b01840
BindingDB Entry DOI: 10.7270/Q2ST7S3J
Dual specificity protein kinase CLK1/CLK4
(Homo sapiens (Human))
BDBM50236540
(CHEMBL4080994)
Show SMILES Oc1ccc(NC(=O)c2cnc3[nH]cc(-c4ccc(O)cc4)c3c2)cc1
Show InChI InChI=1S/C20H15N3O3/c24-15-5-1-12(2-6-15)18-11-22-19-17(18)9-13(10-21-19)20(26)23-14-3-7-16(25)8-4-14/h1-11,24-25H,(H,21,22)(H,23,26)
n/an/an/an/a 1.20E+4n/an/an/an/a
QIMR Berghofer Medical Research Institute
Curated by ChEMBL
Assay Description
Inhibition of CLK1 (unknown origin) using KKGRSRSRSRSRSR as substrate after 40 mins in presence of [gamma-33P]ATP by microbeta scintillation counting
J Med Chem 60: 2052-2070 (2017)
Article DOI: 10.1021/acs.jmedchem.6b01840
BindingDB Entry DOI: 10.7270/Q2ST7S3J
Dual-specificity tyrosine-phosphorylation regulated kinase 2
(Homo sapiens (Human))
BDBM50236540
(CHEMBL4080994)
Show SMILES Oc1ccc(NC(=O)c2cnc3[nH]cc(-c4ccc(O)cc4)c3c2)cc1
Show InChI InChI=1S/C20H15N3O3/c24-15-5-1-12(2-6-15)18-11-22-19-17(18)9-13(10-21-19)20(26)23-14-3-7-16(25)8-4-14/h1-11,24-25H,(H,21,22)(H,23,26)
NCI pathway
n/an/a>1.00E+3n/an/an/an/an/an/a
QIMR Berghofer Medical Research Institute
Curated by ChEMBL
Assay Description
Inhibition of DYRK2 (unknown origin) using woodtide as substrate after 40 mins in presence of [gamma-33P]ATP by microbeta scintillation counting
J Med Chem 60: 2052-2070 (2017)
Article DOI: 10.1021/acs.jmedchem.6b01840
BindingDB Entry DOI: 10.7270/Q2ST7S3J