BDBM50236833 CHEMBL4062687
SMILES: Cl.Cl.CN1CCN(Cc2cn(c3ccccc23)S(=O)(=O)c2ccccc2)CC1
InChI Key: InChIKey=YQOZCQSZCVLKCP-UHFFFAOYSA-N
Data: 1 KI  2 IC50
Activity Spreadsheet -- Enzyme Inhibition Constant Data from BindingDB
Found 3 hits for monomerid = 50236833
Trg + Lig
Ki
nM
ΔG°
kcal/mole
IC50
nM
Kd
nM
EC50/IC50
nM
koff
s-1
kon
M-1s-1
pHTemp
°C
5-hydroxytryptamine receptor 6
(Homo sapiens (Human))
BDBM50236833
(CHEMBL4062687)
Show SMILES Cl.Cl.CN1CCN(Cc2cn(c3ccccc23)S(=O)(=O)c2ccccc2)CC1
Show InChI InChI=1S/C20H23N3O2S/c1-21-11-13-22(14-12-21)15-17-16-23(20-10-6-5-9-19(17)20)26(24,25)18-7-3-2-4-8-18/h2-10,16H,11-15H2,1H3
Reactome pathway
6n/an/an/an/an/an/an/an/a
Suven Life Sciences Ltd
Curated by ChEMBL
Assay Description
Displacement of [3H]-LSD from recombinant human 5-HT6 receptor expressed in HEK293 cells after 60 mins
J Med Chem 60: 1843-1859 (2017)
Article DOI: 10.1021/acs.jmedchem.6b01662
BindingDB Entry DOI: 10.7270/Q27S7R1X
Cytochrome P450 2D6
(Homo sapiens (Human))
BDBM50236833
(CHEMBL4062687)
Show SMILES Cl.Cl.CN1CCN(Cc2cn(c3ccccc23)S(=O)(=O)c2ccccc2)CC1
Show InChI InChI=1S/C20H23N3O2S/c1-21-11-13-22(14-12-21)15-17-16-23(20-10-6-5-9-19(17)20)26(24,25)18-7-3-2-4-8-18/h2-10,16H,11-15H2,1H3
n/an/a>1.00E+4n/an/an/an/an/an/a
Suven Life Sciences Ltd
Curated by ChEMBL
Assay Description
Inhibition of CYP2D6 in human liver microsomes in presence of NADPH by LC-MS/MS analysis
J Med Chem 60: 1843-1859 (2017)
Article DOI: 10.1021/acs.jmedchem.6b01662
BindingDB Entry DOI: 10.7270/Q27S7R1X
Cytochrome P450 3A4
(Homo sapiens (Human))
BDBM50236833
(CHEMBL4062687)
Show SMILES Cl.Cl.CN1CCN(Cc2cn(c3ccccc23)S(=O)(=O)c2ccccc2)CC1
Show InChI InChI=1S/C20H23N3O2S/c1-21-11-13-22(14-12-21)15-17-16-23(20-10-6-5-9-19(17)20)26(24,25)18-7-3-2-4-8-18/h2-10,16H,11-15H2,1H3
Reactome pathway
n/an/a>1.00E+4n/an/an/an/an/an/a
Suven Life Sciences Ltd
Curated by ChEMBL
Assay Description
Agonist activity in rat at Metabotropic glutamate receptor 2 expressed in HEK293 cells
J Med Chem 60: 1843-1859 (2017)
Article DOI: 10.1021/acs.jmedchem.6b01662
BindingDB Entry DOI: 10.7270/Q27S7R1X