BDBM50236844 CHEMBL4100484
SMILES: CS(O)(=O)=O.CS(O)(=O)=O.COc1ccc2n(cc(CN3CCN(C)CC3)c2c1)S(=O)(=O)c1ccc(cc1)C(C)C
InChI Key: InChIKey=KEPYHFKGGRLKPU-UHFFFAOYSA-N
Data: 1 KI  2 IC50
Activity Spreadsheet -- Enzyme Inhibition Constant Data from BindingDB
Found 3 hits for monomerid = 50236844
Trg + Lig
Ki
nM
ΔG°
kcal/mole
IC50
nM
Kd
nM
EC50/IC50
nM
koff
s-1
kon
M-1s-1
pHTemp
°C
5-hydroxytryptamine receptor 6
(Homo sapiens (Human))
BDBM50236844
(CHEMBL4100484)
Show SMILES CS(O)(=O)=O.CS(O)(=O)=O.COc1ccc2n(cc(CN3CCN(C)CC3)c2c1)S(=O)(=O)c1ccc(cc1)C(C)C
Show InChI InChI=1S/C24H31N3O3S/c1-18(2)19-5-8-22(9-6-19)31(28,29)27-17-20(16-26-13-11-25(3)12-14-26)23-15-21(30-4)7-10-24(23)27/h5-10,15,17-18H,11-14,16H2,1-4H3
Reactome pathway
1.60n/an/an/an/an/an/an/an/a
Suven Life Sciences Ltd
Curated by ChEMBL
Assay Description
Displacement of [3H]-LSD from recombinant human 5-HT6 receptor expressed in HEK293 cells after 60 mins
J Med Chem 60: 1843-1859 (2017)
Article DOI: 10.1021/acs.jmedchem.6b01662
BindingDB Entry DOI: 10.7270/Q27S7R1X
Cytochrome P450 2D6
(Homo sapiens (Human))
BDBM50236844
(CHEMBL4100484)
Show SMILES CS(O)(=O)=O.CS(O)(=O)=O.COc1ccc2n(cc(CN3CCN(C)CC3)c2c1)S(=O)(=O)c1ccc(cc1)C(C)C
Show InChI InChI=1S/C24H31N3O3S/c1-18(2)19-5-8-22(9-6-19)31(28,29)27-17-20(16-26-13-11-25(3)12-14-26)23-15-21(30-4)7-10-24(23)27/h5-10,15,17-18H,11-14,16H2,1-4H3
n/an/a 3.35E+4n/an/an/an/an/an/a
Suven Life Sciences Ltd
Curated by ChEMBL
Assay Description
Inhibition of CYP2D6 in human liver microsomes in presence of NADPH by LC-MS/MS analysis
J Med Chem 60: 1843-1859 (2017)
Article DOI: 10.1021/acs.jmedchem.6b01662
BindingDB Entry DOI: 10.7270/Q27S7R1X
Cytochrome P450 3A4
(Homo sapiens (Human))
BDBM50236844
(CHEMBL4100484)
Show SMILES CS(O)(=O)=O.CS(O)(=O)=O.COc1ccc2n(cc(CN3CCN(C)CC3)c2c1)S(=O)(=O)c1ccc(cc1)C(C)C
Show InChI InChI=1S/C24H31N3O3S/c1-18(2)19-5-8-22(9-6-19)31(28,29)27-17-20(16-26-13-11-25(3)12-14-26)23-15-21(30-4)7-10-24(23)27/h5-10,15,17-18H,11-14,16H2,1-4H3
Reactome pathway
n/an/a 1.85E+3n/an/an/an/an/an/a
Suven Life Sciences Ltd
Curated by ChEMBL
Assay Description
Inhibition of CYP3A4 in human liver microsomes using midazolam as substrate in presence of NADPH by LC-MS/MS analysis
J Med Chem 60: 1843-1859 (2017)
Article DOI: 10.1021/acs.jmedchem.6b01662
BindingDB Entry DOI: 10.7270/Q27S7R1X