BDBM50236885 CHEMBL4088788
SMILES: [H][C@]12CCC[C@H](N3CC[C@H](O)C3)[C@@]1([H])N(CCN2S(C)(=O)=O)C(=O)Cc1ccc(Cl)c(F)c1
InChI Key: InChIKey=CRCNINUFPZHOIF-LDBRAYGESA-N
Data: 2 KI  1 EC50
Activity Spreadsheet -- Enzyme Inhibition Constant Data from BindingDB
Found 3 hits for monomerid = 50236885
Trg + Lig
Ki
nM
ΔG°
kcal/mole
IC50
nM
Kd
nM
EC50/IC50
nM
koff
s-1
kon
M-1s-1
pHTemp
°C
Kappa-type opioid receptor
(Cavia porcellus (domestic guinea pig))
BDBM50236885
(CHEMBL4088788)
Show SMILES [H][C@]12CCC[C@H](N3CC[C@H](O)C3)[C@@]1([H])N(CCN2S(C)(=O)=O)C(=O)Cc1ccc(Cl)c(F)c1 |r|
Show InChI InChI=1S/C21H29ClFN3O4S/c1-31(29,30)26-10-9-25(20(28)12-14-5-6-16(22)17(23)11-14)21-18(3-2-4-19(21)26)24-8-7-15(27)13-24/h5-6,11,15,18-19,21,27H,2-4,7-10,12-13H2,1H3/t15-,18-,19-,21+/m0/s1
2.10n/an/an/an/an/an/an/an/a
Dr. August Wolff GmbH& Co. KG Arzneimittel
Curated by ChEMBL
Assay Description
Displacement of [3H]U-69,593 from kappa-type opioid receptor in guinea pig brain membranes after 120 mins by solid scintillation counting
J Med Chem 60: 2526-2551 (2017)
Article DOI: 10.1021/acs.jmedchem.6b01868
BindingDB Entry DOI: 10.7270/Q20C4Z1Z
Mu-type opioid receptor
(GUINEA PIG)
BDBM50236885
(CHEMBL4088788)
Show SMILES [H][C@]12CCC[C@H](N3CC[C@H](O)C3)[C@@]1([H])N(CCN2S(C)(=O)=O)C(=O)Cc1ccc(Cl)c(F)c1 |r|
Show InChI InChI=1S/C21H29ClFN3O4S/c1-31(29,30)26-10-9-25(20(28)12-14-5-6-16(22)17(23)11-14)21-18(3-2-4-19(21)26)24-8-7-15(27)13-24/h5-6,11,15,18-19,21,27H,2-4,7-10,12-13H2,1H3/t15-,18-,19-,21+/m0/s1
308n/an/an/an/an/an/an/an/a
Dr. August Wolff GmbH& Co. KG Arzneimittel
Curated by ChEMBL
Assay Description
Displacement of [3H]DAMGO from mu-type opioid receptor in guinea pig brain membranes after 120 mins by solid scintillation counting
J Med Chem 60: 2526-2551 (2017)
Article DOI: 10.1021/acs.jmedchem.6b01868
BindingDB Entry DOI: 10.7270/Q20C4Z1Z
Kappa-type opioid receptor
(Homo sapiens (Human))
BDBM50236885
(CHEMBL4088788)
Show SMILES [H][C@]12CCC[C@H](N3CC[C@H](O)C3)[C@@]1([H])N(CCN2S(C)(=O)=O)C(=O)Cc1ccc(Cl)c(F)c1 |r|
Show InChI InChI=1S/C21H29ClFN3O4S/c1-31(29,30)26-10-9-25(20(28)12-14-5-6-16(22)17(23)11-14)21-18(3-2-4-19(21)26)24-8-7-15(27)13-24/h5-6,11,15,18-19,21,27H,2-4,7-10,12-13H2,1H3/t15-,18-,19-,21+/m0/s1
Reactome pathway
n/an/an/an/a 8n/an/an/an/a
Dr. August Wolff GmbH& Co. KG Arzneimittel
Curated by ChEMBL
Assay Description
Agonist activity at recombinant human kappa-type opioid receptor expressed in HEK293 cells after 30 mins by [35S]GTPgammaS binding assay
J Med Chem 60: 2526-2551 (2017)
Article DOI: 10.1021/acs.jmedchem.6b01868
BindingDB Entry DOI: 10.7270/Q20C4Z1Z