BDBM50236963 CHEMBL4098236
SMILES: COc1ccccc1N1CCN(CCCCOc2ccn3ncc(C=O)c3c2)CC1
InChI Key: InChIKey=NXGXODYDGLKSAM-UHFFFAOYSA-N
Data: 6 KI  4 EC50
Activity Spreadsheet -- Enzyme Inhibition Constant Data from BindingDB
Found 10 hits for monomerid = 50236963
Trg + Lig
Ki
nM
ΔG°
kcal/mole
IC50
nM
Kd
nM
EC50/IC50
nM
koff
s-1
kon
M-1s-1
pHTemp
°C
D(2) dopamine receptor
(Homo sapiens (Human))
BDBM50236963
(CHEMBL4098236)
Show SMILES COc1ccccc1N1CCN(CCCCOc2ccn3ncc(C=O)c3c2)CC1
Show InChI InChI=1S/C23H28N4O3/c1-29-23-7-3-2-6-21(23)26-13-11-25(12-14-26)9-4-5-15-30-20-8-10-27-22(16-20)19(18-28)17-24-27/h2-3,6-8,10,16-18H,4-5,9,11-15H2,1H3
Reactome pathway
1.80n/an/an/an/an/an/an/an/a
Friedrich-Alexander University Erlangen-N£rnberg
Curated by ChEMBL
Assay Description
Displacement of [3H]spiperone from human Dopamine D2L receptor expressed in CHO cell membranes after 2 hrs by scintillation counting analysis
J Med Chem 60: 2908-2929 (2017)
Article DOI: 10.1021/acs.jmedchem.6b01857
BindingDB Entry DOI: 10.7270/Q2CJ8GR7
D(2) dopamine receptor
(Homo sapiens (Human))
BDBM50236963
(CHEMBL4098236)
Show SMILES COc1ccccc1N1CCN(CCCCOc2ccn3ncc(C=O)c3c2)CC1
Show InChI InChI=1S/C23H28N4O3/c1-29-23-7-3-2-6-21(23)26-13-11-25(12-14-26)9-4-5-15-30-20-8-10-27-22(16-20)19(18-28)17-24-27/h2-3,6-8,10,16-18H,4-5,9,11-15H2,1H3
Reactome pathway
2.30n/an/an/an/an/an/an/an/a
Friedrich-Alexander University Erlangen-N£rnberg
Curated by ChEMBL
Assay Description
Displacement of [3H]spiperone from human Dopamine D2S receptor expressed in CHO cell membranes after 2 hrs by scintillation counting analysis
J Med Chem 60: 2908-2929 (2017)
Article DOI: 10.1021/acs.jmedchem.6b01857
BindingDB Entry DOI: 10.7270/Q2CJ8GR7
D(4) dopamine receptor
(Homo sapiens (Human))
BDBM50236963
(CHEMBL4098236)
Show SMILES COc1ccccc1N1CCN(CCCCOc2ccn3ncc(C=O)c3c2)CC1
Show InChI InChI=1S/C23H28N4O3/c1-29-23-7-3-2-6-21(23)26-13-11-25(12-14-26)9-4-5-15-30-20-8-10-27-22(16-20)19(18-28)17-24-27/h2-3,6-8,10,16-18H,4-5,9,11-15H2,1H3
Reactome pathway
7.10n/an/an/an/an/an/an/an/a
Friedrich-Alexander University Erlangen-N£rnberg
Curated by ChEMBL
Assay Description
Inhibition of FPP incorporation into biotinylated K-Ras-derived peptide by human farnesyl transferase
J Med Chem 60: 2908-2929 (2017)
Article DOI: 10.1021/acs.jmedchem.6b01857
BindingDB Entry DOI: 10.7270/Q2CJ8GR7
D(3) dopamine receptor
(Homo sapiens (Human))
BDBM50236963
(CHEMBL4098236)
Show SMILES COc1ccccc1N1CCN(CCCCOc2ccn3ncc(C=O)c3c2)CC1
Show InChI InChI=1S/C23H28N4O3/c1-29-23-7-3-2-6-21(23)26-13-11-25(12-14-26)9-4-5-15-30-20-8-10-27-22(16-20)19(18-28)17-24-27/h2-3,6-8,10,16-18H,4-5,9,11-15H2,1H3
12n/an/an/an/an/an/an/an/a
Friedrich-Alexander University Erlangen-N£rnberg
Curated by ChEMBL
Assay Description
Displacement of [3H]spiperone from human Dopamine D3 receptor expressed in CHO cell membranes after 2 hrs by scintillation counting analysis
J Med Chem 60: 2908-2929 (2017)
Article DOI: 10.1021/acs.jmedchem.6b01857
BindingDB Entry DOI: 10.7270/Q2CJ8GR7
5-hydroxytryptamine receptor 2A
(Homo sapiens (Human))
BDBM50236963
(CHEMBL4098236)
Show SMILES COc1ccccc1N1CCN(CCCCOc2ccn3ncc(C=O)c3c2)CC1
Show InChI InChI=1S/C23H28N4O3/c1-29-23-7-3-2-6-21(23)26-13-11-25(12-14-26)9-4-5-15-30-20-8-10-27-22(16-20)19(18-28)17-24-27/h2-3,6-8,10,16-18H,4-5,9,11-15H2,1H3
Reactome pathway
350n/an/an/an/an/an/an/an/a
Friedrich-Alexander University Erlangen-N£rnberg
Curated by ChEMBL
Assay Description
Displacement of [3H]ketanserin from human 5-HT2A receptor expressed in HEK293T cell membranes after 2 hrs by scintillation counting analysis
J Med Chem 60: 2908-2929 (2017)
Article DOI: 10.1021/acs.jmedchem.6b01857
BindingDB Entry DOI: 10.7270/Q2CJ8GR7
D(1A) dopamine receptor
(Homo sapiens (Human))
BDBM50236963
(CHEMBL4098236)
Show SMILES COc1ccccc1N1CCN(CCCCOc2ccn3ncc(C=O)c3c2)CC1
Show InChI InChI=1S/C23H28N4O3/c1-29-23-7-3-2-6-21(23)26-13-11-25(12-14-26)9-4-5-15-30-20-8-10-27-22(16-20)19(18-28)17-24-27/h2-3,6-8,10,16-18H,4-5,9,11-15H2,1H3
430n/an/an/an/an/an/an/an/a
Friedrich-Alexander University Erlangen-N£rnberg
Curated by ChEMBL
Assay Description
Displacement of [3H]SCH23390 from human Dopamine D1 receptor expressed in HEK293T cell membranes after 2 hrs by scintillation counting analysis
J Med Chem 60: 2908-2929 (2017)
Article DOI: 10.1021/acs.jmedchem.6b01857
BindingDB Entry DOI: 10.7270/Q2CJ8GR7
D(2) dopamine receptor
(Homo sapiens (Human))
BDBM50236963
(CHEMBL4098236)
Show SMILES COc1ccccc1N1CCN(CCCCOc2ccn3ncc(C=O)c3c2)CC1
Show InChI InChI=1S/C23H28N4O3/c1-29-23-7-3-2-6-21(23)26-13-11-25(12-14-26)9-4-5-15-30-20-8-10-27-22(16-20)19(18-28)17-24-27/h2-3,6-8,10,16-18H,4-5,9,11-15H2,1H3
Reactome pathway
n/an/an/an/a 17n/an/an/an/a
Friedrich-Alexander University Erlangen-N£rnberg
Curated by ChEMBL
Assay Description
Agonist activity at human Dopamine D2S receptor expressed in HEK293T cell membranes coexpressing GalphaoA incubated for 30 mins measured after 75 min...
J Med Chem 60: 2908-2929 (2017)
Article DOI: 10.1021/acs.jmedchem.6b01857
BindingDB Entry DOI: 10.7270/Q2CJ8GR7
D(3) dopamine receptor
(Homo sapiens (Human))
BDBM50236963
(CHEMBL4098236)
Show SMILES COc1ccccc1N1CCN(CCCCOc2ccn3ncc(C=O)c3c2)CC1
Show InChI InChI=1S/C23H28N4O3/c1-29-23-7-3-2-6-21(23)26-13-11-25(12-14-26)9-4-5-15-30-20-8-10-27-22(16-20)19(18-28)17-24-27/h2-3,6-8,10,16-18H,4-5,9,11-15H2,1H3
n/an/an/an/a 7.80n/an/an/an/a
Friedrich-Alexander University Erlangen-N£rnberg
Curated by ChEMBL
Assay Description
Concentration required for the inhibitory activity against human Farnesyltransferase
J Med Chem 60: 2908-2929 (2017)
Article DOI: 10.1021/acs.jmedchem.6b01857
BindingDB Entry DOI: 10.7270/Q2CJ8GR7
D(2) dopamine receptor
(Homo sapiens (Human))
BDBM50236963
(CHEMBL4098236)
Show SMILES COc1ccccc1N1CCN(CCCCOc2ccn3ncc(C=O)c3c2)CC1
Show InChI InChI=1S/C23H28N4O3/c1-29-23-7-3-2-6-21(23)26-13-11-25(12-14-26)9-4-5-15-30-20-8-10-27-22(16-20)19(18-28)17-24-27/h2-3,6-8,10,16-18H,4-5,9,11-15H2,1H3
Reactome pathway
n/an/an/an/a 16n/an/an/an/a
Friedrich-Alexander University Erlangen-N£rnberg
Curated by ChEMBL
Assay Description
Agonist activity at human Dopamine D2S receptor expressed in HEK293T cell membranes coexpressing Galphai2 incubated for 30 mins measured after 75 min...
J Med Chem 60: 2908-2929 (2017)
Article DOI: 10.1021/acs.jmedchem.6b01857
BindingDB Entry DOI: 10.7270/Q2CJ8GR7
D(3) dopamine receptor
(Homo sapiens (Human))
BDBM50236963
(CHEMBL4098236)
Show SMILES COc1ccccc1N1CCN(CCCCOc2ccn3ncc(C=O)c3c2)CC1
Show InChI InChI=1S/C23H28N4O3/c1-29-23-7-3-2-6-21(23)26-13-11-25(12-14-26)9-4-5-15-30-20-8-10-27-22(16-20)19(18-28)17-24-27/h2-3,6-8,10,16-18H,4-5,9,11-15H2,1H3
n/an/an/an/a 7.70n/an/an/an/a
Friedrich-Alexander University Erlangen-N£rnberg
Curated by ChEMBL
Assay Description
Concentration required for the inhibitory activity against human Farnesyltransferase
J Med Chem 60: 2908-2929 (2017)
Article DOI: 10.1021/acs.jmedchem.6b01857
BindingDB Entry DOI: 10.7270/Q2CJ8GR7