BDBM50237382 CHEMBL4073795
SMILES: S=C(SSC(=S)N1CCOC(COc2cccc3ccccc23)C1)N1CCOC(COc2cccc3ccccc23)C1
InChI Key: InChIKey=ZKJMGWRPIJJXKS-UHFFFAOYSA-N
Data: 1 KI  1 IC50
Activity Spreadsheet -- Enzyme Inhibition Constant Data from BindingDB
Found 2 hits for monomerid = 50237382
Trg + Lig
Ki
nM
ΔG°
kcal/mole
IC50
nM
Kd
nM
EC50/IC50
nM
koff
s-1
kon
M-1s-1
pHTemp
°C
[Pyruvate dehydrogenase (acetyl-transferring)] kinase isozyme 1, mitochondrial
(Homo sapiens (Human))
BDBM50237382
(CHEMBL4073795)
Show SMILES S=C(SSC(=S)N1CCOC(COc2cccc3ccccc23)C1)N1CCOC(COc2cccc3ccccc23)C1
Show InChI InChI=1S/C32H32N2O4S4/c39-31(33-15-17-35-25(19-33)21-37-29-13-5-9-23-7-1-3-11-27(23)29)41-42-32(40)34-16-18-36-26(20-34)22-38-30-14-6-10-24-8-2-4-12-28(24)30/h1-14,25-26H,15-22H2
226n/an/an/an/an/an/an/an/a
East China University of Science and Technology
Curated by ChEMBL
Assay Description
Agonist activity against human melanocortin receptor hMC4R
J Med Chem 60: 2227-2244 (2017)
Article DOI: 10.1021/acs.jmedchem.6b01245
BindingDB Entry DOI: 10.7270/Q2RN3B3M
[Pyruvate dehydrogenase (acetyl-transferring)] kinase isozyme 1, mitochondrial
(Homo sapiens (Human))
BDBM50237382
(CHEMBL4073795)
Show SMILES S=C(SSC(=S)N1CCOC(COc2cccc3ccccc23)C1)N1CCOC(COc2cccc3ccccc23)C1
Show InChI InChI=1S/C32H32N2O4S4/c39-31(33-15-17-35-25(19-33)21-37-29-13-5-9-23-7-1-3-11-27(23)29)41-42-32(40)34-16-18-36-26(20-34)22-38-30-14-6-10-24-8-2-4-12-28(24)30/h1-14,25-26H,15-22H2
n/an/a 3.88E+3n/an/an/an/an/an/a
East China University of Science and Technology
Curated by ChEMBL
Assay Description
Inhibition of full length His6-tagged PDK1 (unknown origin) expressed in Escherichia coli using full length His6-tagged PDHA1 as substrate after 30 m...
J Med Chem 60: 2227-2244 (2017)
Article DOI: 10.1021/acs.jmedchem.6b01245
BindingDB Entry DOI: 10.7270/Q2RN3B3M