BDBM50237420 CHEMBL4090361
SMILES: OC[C@H]1CCCN1Cc1ccc(COc2cccc(CS(=O)(=O)c3ccccc3)c2)cc1
InChI Key: InChIKey=CJGFBPTTYOTAQL-XMMPIXPASA-N
Data: 6 IC50
Activity Spreadsheet -- Enzyme Inhibition Constant Data from BindingDB
Found 6 hits for monomerid = 50237420
Trg + Lig
Ki
nM
ΔG°
kcal/mole
IC50
nM
Kd
nM
EC50/IC50
nM
koff
s-1
kon
M-1s-1
pHTemp
°C
Sphingosine kinase 1 (SPHK1)
(Homo sapiens (Human))
BDBM50237420
(CHEMBL4090361)
Show SMILES OC[C@H]1CCCN1Cc1ccc(COc2cccc(CS(=O)(=O)c3ccccc3)c2)cc1 |r|
Show InChI InChI=1S/C26H29NO4S/c28-18-24-7-5-15-27(24)17-21-11-13-22(14-12-21)19-31-25-8-4-6-23(16-25)20-32(29,30)26-9-2-1-3-10-26/h1-4,6,8-14,16,24,28H,5,7,15,17-20H2/t24-/m1/s1
n/an/a 2.40n/an/an/an/an/an/a
Pfizer Inc.
Curated by ChEMBL
Assay Description
Inhibition of human C-terminal His6-tagged SPHK1 expressed in fall armyworm sf9 cells assessed as reduction in S1P formation using sphingosine as sub...
J Med Chem 60: 2562-2572 (2017)
Article DOI: 10.1021/acs.jmedchem.7b00070
BindingDB Entry DOI: 10.7270/Q27P91PG
Sphingosine kinase types 2 (SphK2)
(Homo sapiens (Human))
BDBM50237420
(CHEMBL4090361)
Show SMILES OC[C@H]1CCCN1Cc1ccc(COc2cccc(CS(=O)(=O)c3ccccc3)c2)cc1 |r|
Show InChI InChI=1S/C26H29NO4S/c28-18-24-7-5-15-27(24)17-21-11-13-22(14-12-21)19-31-25-8-4-6-23(16-25)20-32(29,30)26-9-2-1-3-10-26/h1-4,6,8-14,16,24,28H,5,7,15,17-20H2/t24-/m1/s1
n/an/a 164n/an/an/an/an/an/a
Pfizer Inc.
Curated by ChEMBL
Assay Description
Inhibition of SPHK2 (unknown origin) by FITC-based caliper assay
J Med Chem 60: 2562-2572 (2017)
Article DOI: 10.1021/acs.jmedchem.7b00070
BindingDB Entry DOI: 10.7270/Q27P91PG
Sphingosine kinase 1
(Homo sapiens (Human))
BDBM50237420
(CHEMBL4090361)
Show SMILES OC[C@H]1CCCN1Cc1ccc(COc2cccc(CS(=O)(=O)c3ccccc3)c2)cc1 |r|
Show InChI InChI=1S/C26H29NO4S/c28-18-24-7-5-15-27(24)17-21-11-13-22(14-12-21)19-31-25-8-4-6-23(16-25)20-32(29,30)26-9-2-1-3-10-26/h1-4,6,8-14,16,24,28H,5,7,15,17-20H2/t24-/m1/s1
n/an/a 144n/an/an/an/an/an/a
Heriot-Watt University
Curated by ChEMBL
Assay Description
Inhibition of GFP-tagged SK1 (unknown origin) expressed in HEK293 cells using Sph as substrate measured after 30 mins in presence of [gamma32P]ATP by...
J Med Chem 62: 3658-3676 (2019)
Article DOI: 10.1021/acs.jmedchem.9b00162
Sphingosine kinase 1 (SPHK1)
(Homo sapiens (Human))
BDBM50237420
(CHEMBL4090361)
Show SMILES OC[C@H]1CCCN1Cc1ccc(COc2cccc(CS(=O)(=O)c3ccccc3)c2)cc1 |r|
Show InChI InChI=1S/C26H29NO4S/c28-18-24-7-5-15-27(24)17-21-11-13-22(14-12-21)19-31-25-8-4-6-23(16-25)20-32(29,30)26-9-2-1-3-10-26/h1-4,6,8-14,16,24,28H,5,7,15,17-20H2/t24-/m1/s1
n/an/a 2n/an/an/an/an/an/a
Pfizer Inc.
Curated by ChEMBL
Assay Description
Inhibition of human C-terminal His6-tagged SPHK1 expressed in fall armyworm sf9 cells assessed as reduction in ADP formation using sphingosine as sub...
J Med Chem 60: 2562-2572 (2017)
Article DOI: 10.1021/acs.jmedchem.7b00070
BindingDB Entry DOI: 10.7270/Q27P91PG
Sphingosine kinase 1 (SPHK1)
(Homo sapiens (Human))
BDBM50237420
(CHEMBL4090361)
Show SMILES OC[C@H]1CCCN1Cc1ccc(COc2cccc(CS(=O)(=O)c3ccccc3)c2)cc1 |r|
Show InChI InChI=1S/C26H29NO4S/c28-18-24-7-5-15-27(24)17-21-11-13-22(14-12-21)19-31-25-8-4-6-23(16-25)20-32(29,30)26-9-2-1-3-10-26/h1-4,6,8-14,16,24,28H,5,7,15,17-20H2/t24-/m1/s1
n/an/a 35n/an/an/an/an/an/a
Pfizer Inc.
Curated by ChEMBL
Assay Description
Inhibition of SPHK1 in human whole-blood using C17-sphingosine as substrate assessed as reduction in C17-S1P production preincubated for 30 mins foll...
J Med Chem 60: 2562-2572 (2017)
Article DOI: 10.1021/acs.jmedchem.7b00070
BindingDB Entry DOI: 10.7270/Q27P91PG
Sphingosine kinase 1 (SPHK1)
(Homo sapiens (Human))
BDBM50237420
(CHEMBL4090361)
Show SMILES OC[C@H]1CCCN1Cc1ccc(COc2cccc(CS(=O)(=O)c3ccccc3)c2)cc1 |r|
Show InChI InChI=1S/C26H29NO4S/c28-18-24-7-5-15-27(24)17-21-11-13-22(14-12-21)19-31-25-8-4-6-23(16-25)20-32(29,30)26-9-2-1-3-10-26/h1-4,6,8-14,16,24,28H,5,7,15,17-20H2/t24-/m1/s1
n/an/a 0.300n/an/an/an/an/an/a
Pfizer Inc.
Curated by ChEMBL
Assay Description
Inhibition of SPHK1 in human MDA1483 cells using C17-sphingosine as substrate assessed as reduction in C17-S1P formation preincubated for 30 mins wit...
J Med Chem 60: 2562-2572 (2017)
Article DOI: 10.1021/acs.jmedchem.7b00070
BindingDB Entry DOI: 10.7270/Q27P91PG