null
SMILES: N[C@H]1CC[C@@](CCOc2cc(F)c(cc2F)S(=O)(=O)Nc2ncns2)(CC1)c1ccccc1
InChI Key: InChIKey=RUFOCWIZLKLQEG-CIEDQVTBSA-N
Activity Spreadsheet -- Enzyme Inhibition Constant Data from BindingDB
Found 3 hits for monomerid = 50237493
Trg + Lig
Ki
nM
ΔG°
kcal/mole
IC50
nM
Kd
nM
EC50/IC50
nM
koff
s-1
kon
M-1s-1
pHTemp
°C
Sodium channel protein type 9 subunit alpha
(Homo sapiens (Human))
BDBM50237493
(CHEMBL4102633)
Show SMILES N[C@H]1CC[C@@](CCOc2cc(F)c(cc2F)S(=O)(=O)Nc2ncns2)(CC1)c1ccccc1 |r,wU:4.4,1.0,(27.38,-21.24,;27.43,-19.7,;26.12,-18.89,;26.17,-17.36,;27.52,-16.64,;28.3,-15.31,;29.84,-15.32,;30.6,-16.66,;32.14,-16.66,;32.9,-15.34,;34.44,-15.34,;35.21,-14.01,;35.21,-16.69,;34.43,-18.01,;32.89,-18.01,;32.11,-19.33,;36.74,-16.69,;37.16,-15.2,;38.24,-16.3,;37.51,-18.03,;39.05,-18.03,;39.95,-16.79,;41.42,-17.27,;41.41,-18.81,;39.94,-19.28,;28.84,-17.43,;28.79,-18.98,;26.42,-15.54,;26.83,-14.03,;25.74,-12.93,;24.23,-13.33,;23.83,-14.85,;24.93,-15.94,)|
Show InChI InChI=1S/C22H24F2N4O3S2/c23-17-13-20(33(29,30)28-21-26-14-27-32-21)18(24)12-19(17)31-11-10-22(8-6-16(25)7-9-22)15-4-2-1-3-5-15/h1-5,12-14,16H,6-11,25H2,(H,26,27,28)/t16-,22-
n/an/a 15n/an/an/an/an/an/a
Bristol-Myers Squibb
Curated by ChEMBL
Assay Description
Inhibition of recombinant human Nav1.7 expressed in HEK293 cells assessed as reduction in peak inward current at -60 mV holding potential measured af...
J Med Chem 60: 2513-2525 (2017)
Article DOI: 10.1021/acs.jmedchem.6b01918
BindingDB Entry DOI: 10.7270/Q2057J69
Sodium channel protein type 5 subunit alpha
(Homo sapiens (Human))
BDBM50237493
(CHEMBL4102633)
Show SMILES N[C@H]1CC[C@@](CCOc2cc(F)c(cc2F)S(=O)(=O)Nc2ncns2)(CC1)c1ccccc1 |r,wU:4.4,1.0,(27.38,-21.24,;27.43,-19.7,;26.12,-18.89,;26.17,-17.36,;27.52,-16.64,;28.3,-15.31,;29.84,-15.32,;30.6,-16.66,;32.14,-16.66,;32.9,-15.34,;34.44,-15.34,;35.21,-14.01,;35.21,-16.69,;34.43,-18.01,;32.89,-18.01,;32.11,-19.33,;36.74,-16.69,;37.16,-15.2,;38.24,-16.3,;37.51,-18.03,;39.05,-18.03,;39.95,-16.79,;41.42,-17.27,;41.41,-18.81,;39.94,-19.28,;28.84,-17.43,;28.79,-18.98,;26.42,-15.54,;26.83,-14.03,;25.74,-12.93,;24.23,-13.33,;23.83,-14.85,;24.93,-15.94,)|
Show InChI InChI=1S/C22H24F2N4O3S2/c23-17-13-20(33(29,30)28-21-26-14-27-32-21)18(24)12-19(17)31-11-10-22(8-6-16(25)7-9-22)15-4-2-1-3-5-15/h1-5,12-14,16H,6-11,25H2,(H,26,27,28)/t16-,22-
n/an/a>3.00E+4n/an/an/an/an/an/a
Bristol-Myers Squibb
Curated by ChEMBL
Assay Description
Inhibition of recombinant human Nav1.5 expressed in HEK293 cells assessed as reduction in peak inward current at -50 mV holding potential measured af...
J Med Chem 60: 2513-2525 (2017)
Article DOI: 10.1021/acs.jmedchem.6b01918
BindingDB Entry DOI: 10.7270/Q2057J69
Cytochrome P450 3A4
(Homo sapiens (Human))
BDBM50237493
(CHEMBL4102633)
Show SMILES N[C@H]1CC[C@@](CCOc2cc(F)c(cc2F)S(=O)(=O)Nc2ncns2)(CC1)c1ccccc1 |r,wU:4.4,1.0,(27.38,-21.24,;27.43,-19.7,;26.12,-18.89,;26.17,-17.36,;27.52,-16.64,;28.3,-15.31,;29.84,-15.32,;30.6,-16.66,;32.14,-16.66,;32.9,-15.34,;34.44,-15.34,;35.21,-14.01,;35.21,-16.69,;34.43,-18.01,;32.89,-18.01,;32.11,-19.33,;36.74,-16.69,;37.16,-15.2,;38.24,-16.3,;37.51,-18.03,;39.05,-18.03,;39.95,-16.79,;41.42,-17.27,;41.41,-18.81,;39.94,-19.28,;28.84,-17.43,;28.79,-18.98,;26.42,-15.54,;26.83,-14.03,;25.74,-12.93,;24.23,-13.33,;23.83,-14.85,;24.93,-15.94,)|
Show InChI InChI=1S/C22H24F2N4O3S2/c23-17-13-20(33(29,30)28-21-26-14-27-32-21)18(24)12-19(17)31-11-10-22(8-6-16(25)7-9-22)15-4-2-1-3-5-15/h1-5,12-14,16H,6-11,25H2,(H,26,27,28)/t16-,22-
Reactome pathway
n/an/a 430n/an/an/an/an/an/a
Bristol-Myers Squibb
Curated by ChEMBL
Assay Description
Inhibition of human CYP3A4 assessed as inhibition of dealkylation
J Med Chem 60: 2513-2525 (2017)
Article DOI: 10.1021/acs.jmedchem.6b01918
BindingDB Entry DOI: 10.7270/Q2057J69