BDBM50237705 CHEMBL4063086
SMILES: N#C\N=C(\NCc1ccccn1)NCC12CC3CC(CC(C3)C1)C2
InChI Key: InChIKey=HIHBRAWDFBIBNF-UHFFFAOYSA-N
Data: 2 IC50
Activity Spreadsheet -- Enzyme Inhibition Constant Data from BindingDB
Found 2 hits for monomerid = 50237705
Trg + Lig
Ki
nM
ΔG°
kcal/mole
IC50
nM
Kd
nM
EC50/IC50
nM
koff
s-1
kon
M-1s-1
pHTemp
°C
P2X purinoceptor 7
(Homo sapiens (Human))
BDBM50237705
(CHEMBL4063086)
Show SMILES N#C\N=C(\NCc1ccccn1)NCC12CC3CC(CC(C3)C1)C2 |TLB:13:14:17:21.20.19,THB:22:20:17:15.23.14,22:14:17:21.20.19,19:20:15:17.18.23,19:18:15:21.22.20|
Show InChI InChI=1S/C19H25N5/c20-13-24-18(22-11-17-3-1-2-4-21-17)23-12-19-8-14-5-15(9-19)7-16(6-14)10-19/h1-4,14-16H,5-12H2,(H2,22,23,24)
n/an/a 138n/an/an/an/an/an/a
The University of Sydney
Curated by ChEMBL
Assay Description
Inhibition of [3H]AVP binding to recombinant human vasopressin V1a receptor
Eur J Med Chem 130: 433-439 (2017)
Article DOI: 10.1016/j.ejmech.2017.02.060
BindingDB Entry DOI: 10.7270/Q2SJ1NW5
P2X purinoceptor 7
(Homo sapiens (Human))
BDBM50237705
(CHEMBL4063086)
Show SMILES N#C\N=C(\NCc1ccccn1)NCC12CC3CC(CC(C3)C1)C2 |TLB:13:14:17:21.20.19,THB:22:20:17:15.23.14,22:14:17:21.20.19,19:20:15:17.18.23,19:18:15:21.22.20|
Show InChI InChI=1S/C19H25N5/c20-13-24-18(22-11-17-3-1-2-4-21-17)23-12-19-8-14-5-15(9-19)7-16(6-14)10-19/h1-4,14-16H,5-12H2,(H2,22,23,24)
n/an/a 234n/an/an/an/an/an/a
The University of Sydney
Curated by ChEMBL
Assay Description
Binding affinity to human sphingosine 1-phosphate receptor 5 expressed in CHO cells was determined by using [33P]-S1P as radioligand
Eur J Med Chem 130: 433-439 (2017)
Article DOI: 10.1016/j.ejmech.2017.02.060
BindingDB Entry DOI: 10.7270/Q2SJ1NW5