BDBM50237729 CHEMBL4088143
SMILES: N#C\N=C(\NCc1cccnc1)NCC12CC3CC(CC(C3)C1)C2
InChI Key: InChIKey=LHCHSXKJJHJESK-UHFFFAOYSA-N
Data: 2 IC50
Activity Spreadsheet -- Enzyme Inhibition Constant Data from BindingDB
Found 2 hits for monomerid = 50237729
Trg + Lig
Ki
nM
ΔG°
kcal/mole
IC50
nM
Kd
nM
EC50/IC50
nM
koff
s-1
kon
M-1s-1
pHTemp
°C
P2X purinoceptor 7
(Homo sapiens (Human))
BDBM50237729
(CHEMBL4088143)
Show SMILES N#C\N=C(\NCc1cccnc1)NCC12CC3CC(CC(C3)C1)C2 |TLB:13:14:17:21.20.19,THB:22:20:17:15.23.14,22:14:17:21.20.19,19:20:15:17.18.23,19:18:15:21.22.20|
Show InChI InChI=1S/C19H25N5/c20-13-24-18(22-11-14-2-1-3-21-10-14)23-12-19-7-15-4-16(8-19)6-17(5-15)9-19/h1-3,10,15-17H,4-9,11-12H2,(H2,22,23,24)
n/an/a 69n/an/an/an/an/an/a
The University of Sydney
Curated by ChEMBL
Assay Description
Inhibition of [3H]-Ro- 15-1788 binding to human GABA-A receptor alpha-5-beta-3-gamma-2 subunits
Eur J Med Chem 130: 433-439 (2017)
Article DOI: 10.1016/j.ejmech.2017.02.060
BindingDB Entry DOI: 10.7270/Q2SJ1NW5
P2X purinoceptor 7
(Homo sapiens (Human))
BDBM50237729
(CHEMBL4088143)
Show SMILES N#C\N=C(\NCc1cccnc1)NCC12CC3CC(CC(C3)C1)C2 |TLB:13:14:17:21.20.19,THB:22:20:17:15.23.14,22:14:17:21.20.19,19:20:15:17.18.23,19:18:15:21.22.20|
Show InChI InChI=1S/C19H25N5/c20-13-24-18(22-11-14-2-1-3-21-10-14)23-12-19-7-15-4-16(8-19)6-17(5-15)9-19/h1-3,10,15-17H,4-9,11-12H2,(H2,22,23,24)
n/an/a 40n/an/an/an/an/an/a
The University of Sydney
Curated by ChEMBL
Assay Description
Inhibition of [3H]-Ro- 15-1788 binding to recombinant human gamma-aminobutyric-acid A receptor alpha-1-beta-3-gamma-2
Eur J Med Chem 130: 433-439 (2017)
Article DOI: 10.1016/j.ejmech.2017.02.060
BindingDB Entry DOI: 10.7270/Q2SJ1NW5