BDBM50237736 CHEMBL4103467
SMILES: OC(=O)c1ccc(NC(=O)[C@@H]2NC3(CCCCC3)[C@]3([C@H]2c2cccc(Cl)c2F)C(=O)Nc2cc(Cl)ccc32)o1
InChI Key: InChIKey=GSUNXGUAGUHCBD-TWLCBMPQSA-N
Data: 1 KI  1 IC50
Activity Spreadsheet -- Enzyme Inhibition Constant Data from BindingDB
Found 2 hits for monomerid = 50237736
Trg + Lig
Ki
nM
ΔG°
kcal/mole
IC50
nM
Kd
nM
EC50/IC50
nM
koff
s-1
kon
M-1s-1
pHTemp
°C
MDM2-MDMX
(Homo sapiens (Human))
BDBM50237736
(CHEMBL4103467)
Show SMILES OC(=O)c1ccc(NC(=O)[C@@H]2NC3(CCCCC3)[C@]3([C@H]2c2cccc(Cl)c2F)C(=O)Nc2cc(Cl)ccc32)o1 |r|
Show InChI InChI=1S/C28H24Cl2FN3O5/c29-14-7-8-16-18(13-14)32-26(38)28(16)21(15-5-4-6-17(30)22(15)31)23(34-27(28)11-2-1-3-12-27)24(35)33-20-10-9-19(39-20)25(36)37/h4-10,13,21,23,34H,1-3,11-12H2,(H,32,38)(H,33,35)(H,36,37)/t21-,23+,28+/m0/s1
NCI pathway
Reactome pathway
2.80n/an/an/an/an/an/an/an/a
University of Michigan Comprehensive Cancer Center
Curated by ChEMBL
Assay Description
Inhibition of FAM-tagged p53-based PMDM6-F peptide binding to human recombinant His-tagged MDM2 (1 to 118 residues) after 30 mins by fluorescence pol...
J Med Chem 60: 2819-2839 (2017)
Article DOI: 10.1021/acs.jmedchem.6b01665
BindingDB Entry DOI: 10.7270/Q25Q4ZCF
MDM2-MDMX
(Homo sapiens (Human))
BDBM50237736
(CHEMBL4103467)
Show SMILES OC(=O)c1ccc(NC(=O)[C@@H]2NC3(CCCCC3)[C@]3([C@H]2c2cccc(Cl)c2F)C(=O)Nc2cc(Cl)ccc32)o1 |r|
Show InChI InChI=1S/C28H24Cl2FN3O5/c29-14-7-8-16-18(13-14)32-26(38)28(16)21(15-5-4-6-17(30)22(15)31)23(34-27(28)11-2-1-3-12-27)24(35)33-20-10-9-19(39-20)25(36)37/h4-10,13,21,23,34H,1-3,11-12H2,(H,32,38)(H,33,35)(H,36,37)/t21-,23+,28+/m0/s1
NCI pathway
Reactome pathway
n/an/a 18n/an/an/an/an/an/a
University of Michigan Comprehensive Cancer Center
Curated by ChEMBL
Assay Description
Inhibition of FAM-tagged p53-based PMDM6-F peptide binding to human recombinant His-tagged MDM2 (1 to 118 residues) after 30 mins by fluorescence pol...
J Med Chem 60: 2819-2839 (2017)
Article DOI: 10.1021/acs.jmedchem.6b01665
BindingDB Entry DOI: 10.7270/Q25Q4ZCF