BDBM50237993 CHEMBL4060848
SMILES: NC(CO)(CO)CO.CC(C)c1cc2oc(=O)n(CCC(O)=O)c2cc1Cl
InChI Key: InChIKey=ZQKMPGZRKKBYKW-UHFFFAOYSA-N
Data: 2 IC50
Activity Spreadsheet -- Enzyme Inhibition Constant Data from BindingDB
Found 2 hits for monomerid = 50237993
Trg + Lig
Ki
nM
ΔG°
kcal/mole
IC50
nM
Kd
nM
EC50/IC50
nM
koff
s-1
kon
M-1s-1
pHTemp
°C
Kynurenine 3-monooxygenase
(Homo sapiens (Human))
BDBM50237993
(CHEMBL4060848)
Show SMILES NC(CO)(CO)CO.CC(C)c1cc2oc(=O)n(CCC(O)=O)c2cc1Cl
Show InChI InChI=1S/C13H14ClNO4/c1-7(2)8-5-11-10(6-9(8)14)15(13(18)19-11)4-3-12(16)17/h5-7H,3-4H2,1-2H3,(H,16,17)
Reactome pathway
n/an/a 2.00E+3n/an/an/an/an/an/a
GlaxoSmithKline
Curated by ChEMBL
Assay Description
Compound was tested for binding affinity towards Opioid receptor mu 1 by displacing [3H]DAGO radioligand in rat brain P2 synaptosomes membranes.
Bioorg Med Chem Lett 27: 2023-2028 (2017)
Article DOI: 10.1016/j.bmcl.2017.02.078
BindingDB Entry DOI: 10.7270/Q23R0W54
Kynurenine 3-monooxygenase
(Homo sapiens (Human))
BDBM50237993
(CHEMBL4060848)
Show SMILES NC(CO)(CO)CO.CC(C)c1cc2oc(=O)n(CCC(O)=O)c2cc1Cl
Show InChI InChI=1S/C13H14ClNO4/c1-7(2)8-5-11-10(6-9(8)14)15(13(18)19-11)4-3-12(16)17/h5-7H,3-4H2,1-2H3,(H,16,17)
Reactome pathway
n/an/a 100n/an/an/an/an/an/a
GlaxoSmithKline
Curated by ChEMBL
Assay Description
Compound was tested for binding affinity towards Opioid receptor mu 1 by displacing [3H]DAGO radioligand in rat brain P2 synaptosomes membranes.
Bioorg Med Chem Lett 27: 2023-2028 (2017)
Article DOI: 10.1016/j.bmcl.2017.02.078
BindingDB Entry DOI: 10.7270/Q23R0W54