BDBM50238010 CHEMBL4063016
SMILES: OC(=O)CCn1nnc2ccc(Cl)cc12
InChI Key: InChIKey=JBFTXCIQHJKETI-UHFFFAOYSA-N
Data: 1 IC50
Activity Spreadsheet -- Enzyme Inhibition Constant Data from BindingDB
Found 1 hit for monomerid = 50238010
Trg + Lig
Ki
nM
ΔG°
kcal/mole
IC50
nM
Kd
nM
EC50/IC50
nM
koff
s-1
kon
M-1s-1
pHTemp
°C
Kynurenine 3-monooxygenase
(Homo sapiens (Human))
BDBM50238010
(CHEMBL4063016)
Show SMILES OC(=O)CCn1nnc2ccc(Cl)cc12
Show InChI InChI=1S/C9H8ClN3O2/c10-6-1-2-7-8(5-6)13(12-11-7)4-3-9(14)15/h1-2,5H,3-4H2,(H,14,15)
Reactome pathway
n/an/a 501n/an/an/an/an/an/a
GlaxoSmithKline
Curated by ChEMBL
Assay Description
Binding affinity for DA transporter using [125I]RTI-55 in frozen rat caudate membranes
Bioorg Med Chem Lett 27: 2023-2028 (2017)
Article DOI: 10.1016/j.bmcl.2017.02.078
BindingDB Entry DOI: 10.7270/Q23R0W54