BDBM50238015 CHEMBL4070084
SMILES: CC(Cn1ncc2ccc(Cl)cc12)C(O)=O
InChI Key: InChIKey=KPABSJFZADKPSE-UHFFFAOYSA-N
Data: 1 IC50
Activity Spreadsheet -- Enzyme Inhibition Constant Data from BindingDB
Found 1 hit for monomerid = 50238015
Trg + Lig
Ki
nM
ΔG°
kcal/mole
IC50
nM
Kd
nM
EC50/IC50
nM
koff
s-1
kon
M-1s-1
pHTemp
°C
Kynurenine 3-monooxygenase
(Homo sapiens (Human))
BDBM50238015
(CHEMBL4070084)
Show SMILES CC(Cn1ncc2ccc(Cl)cc12)C(O)=O
Show InChI InChI=1S/C11H11ClN2O2/c1-7(11(15)16)6-14-10-4-9(12)3-2-8(10)5-13-14/h2-5,7H,6H2,1H3,(H,15,16)
Reactome pathway
n/an/a 2.51E+3n/an/an/an/an/an/a
GlaxoSmithKline
Curated by ChEMBL
Assay Description
Inhibition of recombinant full-length human N-terminal GST tagged KMO expressed in baculovirus infected Sf9 insect cell membranes using L-kynurenine ...
Bioorg Med Chem Lett 27: 2023-2028 (2017)
Article DOI: 10.1016/j.bmcl.2017.02.078
BindingDB Entry DOI: 10.7270/Q23R0W54