BDBM50238022 CHEMBL4064710
SMILES: OC(=O)CCn1ccc2ccc(Cl)cc12
InChI Key: InChIKey=LLEYHJBTSQUOOP-UHFFFAOYSA-N
Data: 1 IC50
Activity Spreadsheet -- Enzyme Inhibition Constant Data from BindingDB
Found 1 hit for monomerid = 50238022
Trg + Lig
Ki
nM
ΔG°
kcal/mole
IC50
nM
Kd
nM
EC50/IC50
nM
koff
s-1
kon
M-1s-1
pHTemp
°C
Kynurenine 3-monooxygenase
(Homo sapiens (Human))
BDBM50238022
(CHEMBL4064710)
Show SMILES OC(=O)CCn1ccc2ccc(Cl)cc12
Show InChI InChI=1S/C11H10ClNO2/c12-9-2-1-8-3-5-13(10(8)7-9)6-4-11(14)15/h1-3,5,7H,4,6H2,(H,14,15)
Reactome pathway
n/an/a 126n/an/an/an/an/an/a
GlaxoSmithKline
Curated by ChEMBL
Assay Description
Inhibition of recombinant full-length human N-terminal GST tagged KMO expressed in baculovirus infected Sf9 insect cell membranes using L-kynurenine ...
Bioorg Med Chem Lett 27: 2023-2028 (2017)
Article DOI: 10.1016/j.bmcl.2017.02.078
BindingDB Entry DOI: 10.7270/Q23R0W54