BDBM50238023 CHEMBL4065253
SMILES: NC(Cn1ncc2ccc(Cl)cc12)C(O)=O
InChI Key: InChIKey=DMWODZUWOXYIQO-UHFFFAOYSA-N
Data: 1 IC50
Activity Spreadsheet -- Enzyme Inhibition Constant Data from BindingDB
Found 1 hit for monomerid = 50238023
Trg + Lig
Ki
nM
ΔG°
kcal/mole
IC50
nM
Kd
nM
EC50/IC50
nM
koff
s-1
kon
M-1s-1
pHTemp
°C
Kynurenine 3-monooxygenase
(Homo sapiens (Human))
BDBM50238023
(CHEMBL4065253)
Show SMILES NC(Cn1ncc2ccc(Cl)cc12)C(O)=O
Show InChI InChI=1S/C10H10ClN3O2/c11-7-2-1-6-4-13-14(9(6)3-7)5-8(12)10(15)16/h1-4,8H,5,12H2,(H,15,16)
Reactome pathway
n/an/a 2.51E+3n/an/an/an/an/an/a
GlaxoSmithKline
Curated by ChEMBL
Assay Description
Inhibition of recombinant full-length human N-terminal GST tagged KMO expressed in baculovirus infected Sf9 insect cell membranes using L-kynurenine ...
Bioorg Med Chem Lett 27: 2023-2028 (2017)
Article DOI: 10.1016/j.bmcl.2017.02.078
BindingDB Entry DOI: 10.7270/Q23R0W54