null
SMILES: CCn1cc2nccc(Nc3cc(ncc3C)-c3cc(C)ccc3F)c2n1
InChI Key: InChIKey=BRZWIZLQTWSFTJ-UHFFFAOYSA-N
Activity Spreadsheet -- Enzyme Inhibition Constant Data from BindingDB
Found 3 hits for monomerid = 50238095
Trg + Lig
Ki
nM
ΔG°
kcal/mole
IC50
nM
Kd
nM
EC50/IC50
nM
koff
s-1
kon
M-1s-1
pHTemp
°C
TGF-beta receptor type-1
(Homo sapiens (Human))
BDBM50238095
(CHEMBL4082868)
Show SMILES CCn1cc2nccc(Nc3cc(ncc3C)-c3cc(C)ccc3F)c2n1
Show InChI InChI=1S/C21H20FN5/c1-4-27-12-20-21(26-27)17(7-8-23-20)25-18-10-19(24-11-14(18)3)15-9-13(2)5-6-16(15)22/h5-12H,4H2,1-3H3,(H,24,25)
n/an/an/an/a 16n/an/an/an/a
Takeda California
Curated by ChEMBL
Assay Description
Inhibition of ALK5 (unknown origin) expressed in SBE-bla HEK293T cells assessed as decrease in TGFbeta1-induced Smad2/3 phosphorylation by beta lacta...
Bioorg Med Chem Lett 27: 1955-1961 (2017)
Article DOI: 10.1016/j.bmcl.2017.03.026
BindingDB Entry DOI: 10.7270/Q2QJ7KKZ
TGF-beta receptor type-1
(Homo sapiens (Human))
BDBM50238095
(CHEMBL4082868)
Show SMILES CCn1cc2nccc(Nc3cc(ncc3C)-c3cc(C)ccc3F)c2n1
Show InChI InChI=1S/C21H20FN5/c1-4-27-12-20-21(26-27)17(7-8-23-20)25-18-10-19(24-11-14(18)3)15-9-13(2)5-6-16(15)22/h5-12H,4H2,1-3H3,(H,24,25)
n/an/a 10n/an/an/an/an/an/a
Takeda California
Curated by ChEMBL
Assay Description
Inhibition of recombinant N-terminal GST tagged human ALK5 (200 to 503 residues) expressed in baculovirus expression system using FAM-NH2-KVLTQMGSPSI...
Bioorg Med Chem Lett 27: 1955-1961 (2017)
Article DOI: 10.1016/j.bmcl.2017.03.026
BindingDB Entry DOI: 10.7270/Q2QJ7KKZ
TGF-beta receptor type-1
(Homo sapiens (Human))
BDBM50238095
(CHEMBL4082868)
Show SMILES CCn1cc2nccc(Nc3cc(ncc3C)-c3cc(C)ccc3F)c2n1
Show InChI InChI=1S/C21H20FN5/c1-4-27-12-20-21(26-27)17(7-8-23-20)25-18-10-19(24-11-14(18)3)15-9-13(2)5-6-16(15)22/h5-12H,4H2,1-3H3,(H,24,25)
n/an/an/an/a 158n/an/an/an/a
Takeda California
Curated by ChEMBL
Assay Description
Inhibition of ALK5 in human Calu6 cells assessed as reduction in Smad2/3 phosphorylation
Bioorg Med Chem Lett 27: 1955-1961 (2017)
Article DOI: 10.1016/j.bmcl.2017.03.026
BindingDB Entry DOI: 10.7270/Q2QJ7KKZ