BDBM50238097 CHEMBL4075798
SMILES: Cc1ccc(F)c(c1)-c1cc(Nc2ccnc3cn(CC(N)=O)nc23)c(C)cn1
InChI Key: InChIKey=XVQAQEFIHMZUMY-UHFFFAOYSA-N
Data: 1 IC50  1 EC50
Activity Spreadsheet -- Enzyme Inhibition Constant Data from BindingDB
Found 2 hits for monomerid = 50238097
Trg + Lig
Ki
nM
ΔG°
kcal/mole
IC50
nM
Kd
nM
EC50/IC50
nM
koff
s-1
kon
M-1s-1
pHTemp
°C
TGF-beta receptor type-1
(Homo sapiens (Human))
BDBM50238097
(CHEMBL4075798)
Show SMILES Cc1ccc(F)c(c1)-c1cc(Nc2ccnc3cn(CC(N)=O)nc23)c(C)cn1
Show InChI InChI=1S/C21H19FN6O/c1-12-3-4-15(22)14(7-12)18-8-17(13(2)9-25-18)26-16-5-6-24-19-10-28(11-20(23)29)27-21(16)19/h3-10H,11H2,1-2H3,(H2,23,29)(H,25,26)
n/an/a 10n/an/an/an/an/an/a
Takeda California
Curated by ChEMBL
Assay Description
Inhibition of recombinant N-terminal GST tagged human ALK5 (200 to 503 residues) expressed in baculovirus expression system using FAM-NH2-KVLTQMGSPSI...
Bioorg Med Chem Lett 27: 1955-1961 (2017)
Article DOI: 10.1016/j.bmcl.2017.03.026
BindingDB Entry DOI: 10.7270/Q2QJ7KKZ
TGF-beta receptor type-1
(Homo sapiens (Human))
BDBM50238097
(CHEMBL4075798)
Show SMILES Cc1ccc(F)c(c1)-c1cc(Nc2ccnc3cn(CC(N)=O)nc23)c(C)cn1
Show InChI InChI=1S/C21H19FN6O/c1-12-3-4-15(22)14(7-12)18-8-17(13(2)9-25-18)26-16-5-6-24-19-10-28(11-20(23)29)27-21(16)19/h3-10H,11H2,1-2H3,(H2,23,29)(H,25,26)
n/an/an/an/a 251n/an/an/an/a
Takeda California
Curated by ChEMBL
Assay Description
Inhibition of ALK5 in human Calu6 cells assessed as reduction in Smad2/3 phosphorylation
Bioorg Med Chem Lett 27: 1955-1961 (2017)
Article DOI: 10.1016/j.bmcl.2017.03.026
BindingDB Entry DOI: 10.7270/Q2QJ7KKZ