null
SMILES: [Br-].CC(=O)c1c[n+](Cc2ccccc2C)ccc1CC1Cc2cc(Cl)ccc2C1=O
InChI Key: InChIKey=IVQARBNRYZOHDC-UHFFFAOYSA-M
Activity Spreadsheet -- Enzyme Inhibition Constant Data from BindingDB
Found 2 hits for monomerid = 50238239
Trg + Lig
Ki
nM
ΔG°
kcal/mole
IC50
nM
Kd
nM
EC50/IC50
nM
koff
s-1
kon
M-1s-1
pHTemp
°C
Acetylcholinesterase
(Homo sapiens (Human))
BDBM50238239
(CHEMBL4099873)
Show SMILES [Br-].CC(=O)c1c[n+](Cc2ccccc2C)ccc1CC1Cc2cc(Cl)ccc2C1=O
Show InChI InChI=1S/C25H23ClNO2.BrH/c1-16-5-3-4-6-19(16)14-27-10-9-18(24(15-27)17(2)28)11-21-12-20-13-22(26)7-8-23(20)25(21)29;/h3-10,13,15,21H,11-12,14H2,1-2H3;1H/q+1;/p-1
NCI pathway
Reactome pathway
n/an/a 262n/an/an/an/an/an/a
VFP Therapies
Curated by ChEMBL
Assay Description
Inhibition of AChE in human erythrocytes using acetylthiocholine iodide as substrate preincubated for 5 mins followed by substrate addition measured ...
J Med Chem 60: 5909-5926 (2017)
Article DOI: 10.1021/acs.jmedchem.7b00702
BindingDB Entry DOI: 10.7270/Q22V2JC5
Cholinesterase
(Equus caballus (Horse))
BDBM50238239
(CHEMBL4099873)
Show SMILES [Br-].CC(=O)c1c[n+](Cc2ccccc2C)ccc1CC1Cc2cc(Cl)ccc2C1=O
Show InChI InChI=1S/C25H23ClNO2.BrH/c1-16-5-3-4-6-19(16)14-27-10-9-18(24(15-27)17(2)28)11-21-12-20-13-22(26)7-8-23(20)25(21)29;/h3-10,13,15,21H,11-12,14H2,1-2H3;1H/q+1;/p-1
n/an/a 3.63E+3n/an/an/an/an/an/a
VFP Therapies
Curated by ChEMBL
Assay Description
Inhibition of equine serum BChE using butyrylthiocholine iodide as substrate preincubated for 5 mins followed by substrate addition measured every mi...
J Med Chem 60: 5909-5926 (2017)
Article DOI: 10.1021/acs.jmedchem.7b00702
BindingDB Entry DOI: 10.7270/Q22V2JC5