BDBM50238380 CHEMBL4079325
SMILES: CC(C)Oc1ccc(cc1)-c1cn2c(nn(-c3ccccc3)c2=O)c(N)n1
InChI Key: InChIKey=ZQKOWVMSUCJGDZ-UHFFFAOYSA-N
Data: 3 KI  1 IC50
Activity Spreadsheet -- Enzyme Inhibition Constant Data from BindingDB
Found 4 hits for monomerid = 50238380
Trg + Lig
Ki
nM
ΔG°
kcal/mole
IC50
nM
Kd
nM
EC50/IC50
nM
koff
s-1
kon
M-1s-1
pHTemp
°C
Adenosine receptor A2a
(Homo sapiens (Human))
BDBM50238380
(CHEMBL4079325)
Show SMILES CC(C)Oc1ccc(cc1)-c1cn2c(nn(-c3ccccc3)c2=O)c(N)n1
Show InChI InChI=1S/C20H19N5O2/c1-13(2)27-16-10-8-14(9-11-16)17-12-24-19(18(21)22-17)23-25(20(24)26)15-6-4-3-5-7-15/h3-13H,1-2H3,(H2,21,22)
NCI pathway
Reactome pathway
7.40n/an/an/an/an/an/an/an/a
Universit£ degli Studi di Firenze
Curated by ChEMBL
Assay Description
Displacement of [3H]NECA from human adenosine receptor A2A expressed in CHO cell membranes after 3 hrs by microbeta scintillation counting method
J Med Chem 60: 5772-5790 (2017)
Article DOI: 10.1021/acs.jmedchem.7b00457
BindingDB Entry DOI: 10.7270/Q21V5H87
Adenosine receptor A1
(Homo sapiens (Human))
BDBM50238380
(CHEMBL4079325)
Show SMILES CC(C)Oc1ccc(cc1)-c1cn2c(nn(-c3ccccc3)c2=O)c(N)n1
Show InChI InChI=1S/C20H19N5O2/c1-13(2)27-16-10-8-14(9-11-16)17-12-24-19(18(21)22-17)23-25(20(24)26)15-6-4-3-5-7-15/h3-13H,1-2H3,(H2,21,22)
Reactome pathway
>3.00E+4n/an/an/an/an/an/an/an/a
Universit£ degli Studi di Firenze
Curated by ChEMBL
Assay Description
Displacement of [3H]CCPA from human adenosine receptor A1 expressed in CHO cell membranes after 3 hrs by microbeta scintillation counting method
J Med Chem 60: 5772-5790 (2017)
Article DOI: 10.1021/acs.jmedchem.7b00457
BindingDB Entry DOI: 10.7270/Q21V5H87
Adenosine receptor A3
(Homo sapiens (Human))
BDBM50238380
(CHEMBL4079325)
Show SMILES CC(C)Oc1ccc(cc1)-c1cn2c(nn(-c3ccccc3)c2=O)c(N)n1
Show InChI InChI=1S/C20H19N5O2/c1-13(2)27-16-10-8-14(9-11-16)17-12-24-19(18(21)22-17)23-25(20(24)26)15-6-4-3-5-7-15/h3-13H,1-2H3,(H2,21,22)
Reactome pathway
>3.00E+4n/an/an/an/an/an/an/an/a
Universit£ degli Studi di Firenze
Curated by ChEMBL
Assay Description
Displacement of [3H]HEMADO from human adenosine receptor A3 expressed in CHO cell membranes after 3 hrs by microbeta scintillation counting method
J Med Chem 60: 5772-5790 (2017)
Article DOI: 10.1021/acs.jmedchem.7b00457
BindingDB Entry DOI: 10.7270/Q21V5H87
Adenosine receptor A2b
(Homo sapiens (Human))
BDBM50238380
(CHEMBL4079325)
Show SMILES CC(C)Oc1ccc(cc1)-c1cn2c(nn(-c3ccccc3)c2=O)c(N)n1
Show InChI InChI=1S/C20H19N5O2/c1-13(2)27-16-10-8-14(9-11-16)17-12-24-19(18(21)22-17)23-25(20(24)26)15-6-4-3-5-7-15/h3-13H,1-2H3,(H2,21,22)
NCI pathway
Reactome pathway
n/an/a>3.00E+4n/an/an/an/an/an/a
Universit£ degli Studi di Firenze
Curated by ChEMBL
Assay Description
Inhibition of norepinephrine uptake in synaptosomal preparation fro rat hypothalamus, using [3H]norepinephrine
J Med Chem 60: 5772-5790 (2017)
Article DOI: 10.1021/acs.jmedchem.7b00457
BindingDB Entry DOI: 10.7270/Q21V5H87