BDBM50238970 CHEMBL4094336
SMILES: Cc1cc(C)c2n(CCCCN3CCOCC3)c3ccccc3c(=O)c2c1
InChI Key: InChIKey=XONLDSYHSCDNKT-UHFFFAOYSA-N
Data: 1 IC50
Activity Spreadsheet -- Enzyme Inhibition Constant Data from BindingDB
Found 1 hit for monomerid = 50238970
Trg + Lig
Ki
nM
ΔG°
kcal/mole
IC50
nM
Kd
nM
EC50/IC50
nM
koff
s-1
kon
M-1s-1
pHTemp
°C
Multidrug resistance protein 1/Multidrug resistance associated protein 1
(Homo sapiens (Human))
BDBM50238970
(CHEMBL4094336)
Show SMILES Cc1cc(C)c2n(CCCCN3CCOCC3)c3ccccc3c(=O)c2c1
Show InChI InChI=1S/C23H28N2O2/c1-17-15-18(2)22-20(16-17)23(26)19-7-3-4-8-21(19)25(22)10-6-5-9-24-11-13-27-14-12-24/h3-4,7-8,15-16H,5-6,9-14H2,1-2H3
n/an/a 4n/an/an/an/an/an/a
SVKM's Dr. Bhanuben Nanavati College of Pharmacy
Curated by ChEMBL
Assay Description
Inhibition of ABCB1 in human MCF7/ADR cells assessed as potentiation of vinblastine-induced cytotoxicity by measuring vinblastine IC50 at IC10 after ...
Eur J Med Chem 130: 154-170 (2017)
Article DOI: 10.1016/j.ejmech.2017.02.022
BindingDB Entry DOI: 10.7270/Q26D5W99