BDBM50239047 CHEMBL4078915
SMILES: CN1C(CCC1=O)c1cc2[nH]c(cc2cc1Oc1ccc(nc1)S(C)(=O)=O)-c1cnccn1
InChI Key: InChIKey=SWHHKLQQVAMTGD-UHFFFAOYSA-N
Data: 8 EC50
Activity Spreadsheet -- Enzyme Inhibition Constant Data from BindingDB
Found 8 hits for monomerid = 50239047
Trg + Lig
Ki
nM
ΔG°
kcal/mole
IC50
nM
Kd
nM
EC50/IC50
nM
koff
s-1
kon
M-1s-1
pHTemp
°C
Glucokinase/Glucokinase regulatory protein
(Homo sapiens (Human))
BDBM50239047
(CHEMBL4078915)
Show SMILES CN1C(CCC1=O)c1cc2[nH]c(cc2cc1Oc1ccc(nc1)S(C)(=O)=O)-c1cnccn1
Show InChI InChI=1S/C23H21N5O4S/c1-28-20(4-6-23(28)29)16-11-17-14(9-18(27-17)19-13-24-7-8-25-19)10-21(16)32-15-3-5-22(26-12-15)33(2,30)31/h3,5,7-13,20,27H,4,6H2,1-2H3
NCI pathway
Reactome pathway
n/an/an/an/a 48n/an/an/an/a
Merck& Co., Inc.
Curated by ChEMBL
Assay Description
Activation of recombinant human glucokinase assessed as conversion of D-glucose to D-glucose-6-phosphate in presence of 2.5 mM glucose by G6PDH coupl...
Bioorg Med Chem Lett 27: 2069-2073 (2017)
Article DOI: 10.1016/j.bmcl.2016.10.085
BindingDB Entry DOI: 10.7270/Q2DZ0BM6
Hexokinase type IV
(Rattus norvegicus)
BDBM50239047
(CHEMBL4078915)
Show SMILES CN1C(CCC1=O)c1cc2[nH]c(cc2cc1Oc1ccc(nc1)S(C)(=O)=O)-c1cnccn1
Show InChI InChI=1S/C23H21N5O4S/c1-28-20(4-6-23(28)29)16-11-17-14(9-18(27-17)19-13-24-7-8-25-19)10-21(16)32-15-3-5-22(26-12-15)33(2,30)31/h3,5,7-13,20,27H,4,6H2,1-2H3
Reactome pathway
n/an/an/an/a 7.20n/an/an/an/a
Merck& Co., Inc.
Curated by ChEMBL
Assay Description
Activation of glucokinase in rat INS-1 cells assessed as increase in D-2-deoxyglucose-6-phosphate level in presence of D-2-deoxyglucose by HILIC LC-M...
Bioorg Med Chem Lett 27: 2069-2073 (2017)
Article DOI: 10.1016/j.bmcl.2016.10.085
BindingDB Entry DOI: 10.7270/Q2DZ0BM6
Hexokinase type IV
(Rattus norvegicus)
BDBM50239047
(CHEMBL4078915)
Show SMILES CN1C(CCC1=O)c1cc2[nH]c(cc2cc1Oc1ccc(nc1)S(C)(=O)=O)-c1cnccn1
Show InChI InChI=1S/C23H21N5O4S/c1-28-20(4-6-23(28)29)16-11-17-14(9-18(27-17)19-13-24-7-8-25-19)10-21(16)32-15-3-5-22(26-12-15)33(2,30)31/h3,5,7-13,20,27H,4,6H2,1-2H3
Reactome pathway
n/an/an/an/a 23n/an/an/an/a
Merck& Co., Inc.
Curated by ChEMBL
Assay Description
Activation of glucokinase in primary rat hepatocytes assessed as increase in D-2-deoxyglucose-6-phosphate level in presence of D-2-deoxyglucose by HI...
Bioorg Med Chem Lett 27: 2069-2073 (2017)
Article DOI: 10.1016/j.bmcl.2016.10.085
BindingDB Entry DOI: 10.7270/Q2DZ0BM6
Glucokinase/Glucokinase regulatory protein
(Homo sapiens (Human))
BDBM50239047
(CHEMBL4078915)
Show SMILES CN1C(CCC1=O)c1cc2[nH]c(cc2cc1Oc1ccc(nc1)S(C)(=O)=O)-c1cnccn1
Show InChI InChI=1S/C23H21N5O4S/c1-28-20(4-6-23(28)29)16-11-17-14(9-18(27-17)19-13-24-7-8-25-19)10-21(16)32-15-3-5-22(26-12-15)33(2,30)31/h3,5,7-13,20,27H,4,6H2,1-2H3
NCI pathway
Reactome pathway
n/an/an/an/a 4.5n/an/an/an/a
Merck& Co., Inc.
Curated by ChEMBL
Assay Description
Activation of recombinant human glucokinase assessed as conversion of D-glucose to D-glucose-6-phosphate in presence of 2.5 mM glucose by G6PDH coupl...
Bioorg Med Chem Lett 27: 2069-2073 (2017)
Article DOI: 10.1016/j.bmcl.2016.10.085
BindingDB Entry DOI: 10.7270/Q2DZ0BM6
Glucokinase/Glucokinase regulatory protein
(Homo sapiens (Human))
BDBM50239047
(CHEMBL4078915)
Show SMILES CN1C(CCC1=O)c1cc2[nH]c(cc2cc1Oc1ccc(nc1)S(C)(=O)=O)-c1cnccn1
Show InChI InChI=1S/C23H21N5O4S/c1-28-20(4-6-23(28)29)16-11-17-14(9-18(27-17)19-13-24-7-8-25-19)10-21(16)32-15-3-5-22(26-12-15)33(2,30)31/h3,5,7-13,20,27H,4,6H2,1-2H3
NCI pathway
Reactome pathway
n/an/an/an/a 4.20n/an/an/an/a
Merck& Co., Inc.
Curated by ChEMBL
Assay Description
Activation of recombinant human glucokinase assessed as conversion of D-glucose to D-glucose-6-phosphate in presence of 10 mM glucose by G6PDH couple...
Bioorg Med Chem Lett 27: 2069-2073 (2017)
Article DOI: 10.1016/j.bmcl.2016.10.085
BindingDB Entry DOI: 10.7270/Q2DZ0BM6
Glucokinase/Glucokinase regulatory protein
(Homo sapiens (Human))
BDBM50239047
(CHEMBL4078915)
Show SMILES CN1C(CCC1=O)c1cc2[nH]c(cc2cc1Oc1ccc(nc1)S(C)(=O)=O)-c1cnccn1
Show InChI InChI=1S/C23H21N5O4S/c1-28-20(4-6-23(28)29)16-11-17-14(9-18(27-17)19-13-24-7-8-25-19)10-21(16)32-15-3-5-22(26-12-15)33(2,30)31/h3,5,7-13,20,27H,4,6H2,1-2H3
NCI pathway
Reactome pathway
n/an/an/an/a 18n/an/an/an/a
Merck& Co., Inc.
Curated by ChEMBL
Assay Description
Activation of recombinant human glucokinase assessed as conversion of D-glucose to D-glucose-6-phosphate in presence of 10 mM glucose by G6PDH couple...
Bioorg Med Chem Lett 27: 2069-2073 (2017)
Article DOI: 10.1016/j.bmcl.2016.10.085
BindingDB Entry DOI: 10.7270/Q2DZ0BM6
Hexokinase type IV
(Rattus norvegicus)
BDBM50239047
(CHEMBL4078915)
Show SMILES CN1C(CCC1=O)c1cc2[nH]c(cc2cc1Oc1ccc(nc1)S(C)(=O)=O)-c1cnccn1
Show InChI InChI=1S/C23H21N5O4S/c1-28-20(4-6-23(28)29)16-11-17-14(9-18(27-17)19-13-24-7-8-25-19)10-21(16)32-15-3-5-22(26-12-15)33(2,30)31/h3,5,7-13,20,27H,4,6H2,1-2H3
Reactome pathway
n/an/an/an/a 247n/an/an/an/a
Merck& Co., Inc.
Curated by ChEMBL
Assay Description
Activation of glucokinase in rat INS-1 cells assessed as increase in D-2-deoxyglucose-6-phosphate level in presence of D-2-deoxyglucose by HILIC LC-M...
Bioorg Med Chem Lett 27: 2069-2073 (2017)
Article DOI: 10.1016/j.bmcl.2016.10.085
BindingDB Entry DOI: 10.7270/Q2DZ0BM6
Hexokinase type IV
(Rattus norvegicus)
BDBM50239047
(CHEMBL4078915)
Show SMILES CN1C(CCC1=O)c1cc2[nH]c(cc2cc1Oc1ccc(nc1)S(C)(=O)=O)-c1cnccn1
Show InChI InChI=1S/C23H21N5O4S/c1-28-20(4-6-23(28)29)16-11-17-14(9-18(27-17)19-13-24-7-8-25-19)10-21(16)32-15-3-5-22(26-12-15)33(2,30)31/h3,5,7-13,20,27H,4,6H2,1-2H3
Reactome pathway
n/an/an/an/a 1.51E+3n/an/an/an/a
Merck& Co., Inc.
Curated by ChEMBL
Assay Description
Activation of glucokinase in primary rat hepatocytes assessed as increase in D-2-deoxyglucose-6-phosphate level in presence of D-2-deoxyglucose by HI...
Bioorg Med Chem Lett 27: 2069-2073 (2017)
Article DOI: 10.1016/j.bmcl.2016.10.085
BindingDB Entry DOI: 10.7270/Q2DZ0BM6