BDBM50239059 CHEMBL4059503
SMILES: CN(C)c1nc2ccc(cc2c(Cl)c1-c1ccccc1)C(O)(c1cncn1C)c1ccncc1
InChI Key: InChIKey=SEJAMGYPDDPTHR-UHFFFAOYSA-N
Data: 3 IC50  3 Kd
PDB links: 1 PDB ID matches this monomer.
Activity Spreadsheet -- Enzyme Inhibition Constant Data from BindingDB
Found 6 hits for monomerid = 50239059
Trg + Lig
Ki
nM
ΔG°
kcal/mole
IC50
nM
Kd
nM
EC50/IC50
nM
koff
s-1
kon
M-1s-1
pHTemp
°C
Nuclear receptor ROR-gamma (RORC)
(Homo sapiens (Human))
BDBM50239059
(CHEMBL4059503)
Show SMILES CN(C)c1nc2ccc(cc2c(Cl)c1-c1ccccc1)C(O)(c1cncn1C)c1ccncc1
Show InChI InChI=1S/C27H24ClN5O/c1-32(2)26-24(18-7-5-4-6-8-18)25(28)21-15-20(9-10-22(21)31-26)27(34,19-11-13-29-14-12-19)23-16-30-17-33(23)3/h4-17,34H,1-3H3
n/an/a 11n/an/an/an/an/an/a
Janssen Research and Development
Curated by ChEMBL
Assay Description
Inverse agonist activity at GAL4 DBD-fused human RORgammat expressed in HEK293T cells assessed as inhibition of transcriptional activity after 24 hrs...
Bioorg Med Chem Lett 27: 2047-2057 (2017)
Article DOI: 10.1016/j.bmcl.2017.02.044
BindingDB Entry DOI: 10.7270/Q25H7JCJ
3D
3D Structure (crystal)
Nuclear receptor ROR-gamma (RORC)
(Homo sapiens (Human))
BDBM50239059
(CHEMBL4059503)
Show SMILES CN(C)c1nc2ccc(cc2c(Cl)c1-c1ccccc1)C(O)(c1cncn1C)c1ccncc1
Show InChI InChI=1S/C27H24ClN5O/c1-32(2)26-24(18-7-5-4-6-8-18)25(28)21-15-20(9-10-22(21)31-26)27(34,19-11-13-29-14-12-19)23-16-30-17-33(23)3/h4-17,34H,1-3H3
n/an/a 620n/an/an/an/an/an/a
Janssen Research and Development
Curated by ChEMBL
Assay Description
Inverse agonist activity at GAL4 DBD-fused human RORgammat expressed in HEK293T cells assessed as inhibition of transcriptional activity after 24 hrs...
Bioorg Med Chem Lett 27: 2047-2057 (2017)
Article DOI: 10.1016/j.bmcl.2017.02.044
BindingDB Entry DOI: 10.7270/Q25H7JCJ
3D
3D Structure (crystal)
Nuclear receptor ROR-gamma (RORC)
(Homo sapiens (Human))
BDBM50239059
(CHEMBL4059503)
Show SMILES CN(C)c1nc2ccc(cc2c(Cl)c1-c1ccccc1)C(O)(c1cncn1C)c1ccncc1
Show InChI InChI=1S/C27H24ClN5O/c1-32(2)26-24(18-7-5-4-6-8-18)25(28)21-15-20(9-10-22(21)31-26)27(34,19-11-13-29-14-12-19)23-16-30-17-33(23)3/h4-17,34H,1-3H3
n/an/an/a 2n/an/an/an/an/a
Janssen Research and Development
Curated by ChEMBL
Assay Description
Binding affinity against Dopamine receptor D2 using [3H]spiperone as radioligand
Bioorg Med Chem Lett 27: 2047-2057 (2017)
Article DOI: 10.1016/j.bmcl.2017.02.044
BindingDB Entry DOI: 10.7270/Q25H7JCJ
3D
3D Structure (crystal)
Nuclear receptor ROR-gamma (RORC)
(Homo sapiens (Human))
BDBM50239059
(CHEMBL4059503)
Show SMILES CN(C)c1nc2ccc(cc2c(Cl)c1-c1ccccc1)C(O)(c1cncn1C)c1ccncc1
Show InChI InChI=1S/C27H24ClN5O/c1-32(2)26-24(18-7-5-4-6-8-18)25(28)21-15-20(9-10-22(21)31-26)27(34,19-11-13-29-14-12-19)23-16-30-17-33(23)3/h4-17,34H,1-3H3
n/an/an/a 2n/an/an/an/an/a
Janssen Research and Development
Curated by ChEMBL
Assay Description
Displacement of 1,8-ANS from recombinant human RORgammat LBD expressed in Escherichia coli BL21 (DE3) cells assessed as inhibition of co-activator SR...
Bioorg Med Chem Lett 27: 2047-2057 (2017)
Article DOI: 10.1016/j.bmcl.2017.02.044
BindingDB Entry DOI: 10.7270/Q25H7JCJ
3D
3D Structure (crystal)
Nuclear receptor ROR-gamma (RORC)
(Homo sapiens (Human))
BDBM50239059
(CHEMBL4059503)
Show SMILES CN(C)c1nc2ccc(cc2c(Cl)c1-c1ccccc1)C(O)(c1cncn1C)c1ccncc1
Show InChI InChI=1S/C27H24ClN5O/c1-32(2)26-24(18-7-5-4-6-8-18)25(28)21-15-20(9-10-22(21)31-26)27(34,19-11-13-29-14-12-19)23-16-30-17-33(23)3/h4-17,34H,1-3H3
n/an/a 7.5n/an/an/an/an/an/a
Janssen Research and Development
Curated by ChEMBL
Assay Description
Inverse agonist activity at GAL4 DBD-fused human RORgammat expressed in HEK293T cells assessed as inhibition of transcriptional activity after 24 hrs...
Bioorg Med Chem Lett 27: 2047-2057 (2017)
Article DOI: 10.1016/j.bmcl.2017.02.044
BindingDB Entry DOI: 10.7270/Q25H7JCJ
3D
3D Structure (crystal)
Nuclear receptor ROR-gamma (RORC)
(Homo sapiens (Human))
BDBM50239059
(CHEMBL4059503)
Show SMILES CN(C)c1nc2ccc(cc2c(Cl)c1-c1ccccc1)C(O)(c1cncn1C)c1ccncc1
Show InChI InChI=1S/C27H24ClN5O/c1-32(2)26-24(18-7-5-4-6-8-18)25(28)21-15-20(9-10-22(21)31-26)27(34,19-11-13-29-14-12-19)23-16-30-17-33(23)3/h4-17,34H,1-3H3
n/an/an/a 290n/an/an/an/an/a
Janssen Research and Development
Curated by ChEMBL
Assay Description
Displacement of 1,8-ANS from recombinant human RORgammat LBD expressed in Escherichia coli BL21 (DE3) cells assessed as inhibition of co-activator SR...
Bioorg Med Chem Lett 27: 2047-2057 (2017)
Article DOI: 10.1016/j.bmcl.2017.02.044
BindingDB Entry DOI: 10.7270/Q25H7JCJ
3D
3D Structure (crystal)