BDBM50239481 CHEMBL4061308
SMILES: COc1ccc(cc1)-c1nnc(o1)-c1ccc2nc([nH]c2c1)-c1c(C)cc(CCC(O)=O)cc1C
InChI Key: InChIKey=MINLAUDEZKJETF-UHFFFAOYSA-N
Data: 2 IC50
Activity Spreadsheet -- Enzyme Inhibition Constant Data from BindingDB
Found 2 hits for monomerid = 50239481
Trg + Lig
Ki
nM
ΔG°
kcal/mole
IC50
nM
Kd
nM
EC50/IC50
nM
koff
s-1
kon
M-1s-1
pHTemp
°C
Diacylglycerol O-acyltransferase 1 (DGAT1)
(Homo sapiens (Human))
BDBM50239481
(CHEMBL4061308)
Show SMILES COc1ccc(cc1)-c1nnc(o1)-c1ccc2nc([nH]c2c1)-c1c(C)cc(CCC(O)=O)cc1C
Show InChI InChI=1S/C27H24N4O4/c1-15-12-17(4-11-23(32)33)13-16(2)24(15)25-28-21-10-7-19(14-22(21)29-25)27-31-30-26(35-27)18-5-8-20(34-3)9-6-18/h5-10,12-14H,4,11H2,1-3H3,(H,28,29)(H,32,33)
n/an/a 10n/an/an/an/an/an/a
Novartis Institutes for Biomedical Research
Curated by ChEMBL
Assay Description
Inhibition of recombinant human His6-tagged DGAT1 expressed in Sf9 insect cell membranes assessed as inhibition of triglyceride formation using diole...
J Med Chem 60: 4657-4664 (2017)
Article DOI: 10.1021/acs.jmedchem.7b00173
BindingDB Entry DOI: 10.7270/Q2B27XF2
Diacylglycerol O-acyltransferase 1
(Mus musculus (mouse))
BDBM50239481
(CHEMBL4061308)
Show SMILES COc1ccc(cc1)-c1nnc(o1)-c1ccc2nc([nH]c2c1)-c1c(C)cc(CCC(O)=O)cc1C
Show InChI InChI=1S/C27H24N4O4/c1-15-12-17(4-11-23(32)33)13-16(2)24(15)25-28-21-10-7-19(14-22(21)29-25)27-31-30-26(35-27)18-5-8-20(34-3)9-6-18/h5-10,12-14H,4,11H2,1-3H3,(H,28,29)(H,32,33)
Reactome pathway
n/an/a 181n/an/an/an/an/an/a
Novartis Institutes for Biomedical Research
Curated by ChEMBL
Assay Description
Inhibition of DGTA1 in mouse C2C12 cells assessed as inhibition of triglyceride formation after 2 hrs by LC/MS/MS analysis
J Med Chem 60: 4657-4664 (2017)
Article DOI: 10.1021/acs.jmedchem.7b00173
BindingDB Entry DOI: 10.7270/Q2B27XF2