BDBM50239493 CHEMBL4103497::US10329302, Example 312::US10793579, Example 312
SMILES: CCC[C@@H]1CC(=O)N[C@@H]1COc1nccc2cc(C(N)=O)c(OC)cc12
InChI Key: InChIKey=NOLFQBKTECYKHP-IUODEOHRSA-N
Data: 4 IC50
Activity Spreadsheet -- Enzyme Inhibition Constant Data from BindingDB
Found 4 hits for monomerid = 50239493
Trg + Lig
Ki
nM
ΔG°
kcal/mole
IC50
nM
Kd
nM
EC50/IC50
nM
koff
s-1
kon
M-1s-1
pHTemp
°C
Interleukin-1 receptor-associated kinase 4
(Homo sapiens (Human))
BDBM50239493
(CHEMBL4103497 | US10329302, Example 312 | US107935...)
Show SMILES CCC[C@@H]1CC(=O)N[C@@H]1COc1nccc2cc(C(N)=O)c(OC)cc12 |r|
Show InChI InChI=1S/C19H23N3O4/c1-3-4-12-8-17(23)22-15(12)10-26-19-13-9-16(25-2)14(18(20)24)7-11(13)5-6-21-19/h5-7,9,12,15H,3-4,8,10H2,1-2H3,(H2,20,24)(H,22,23)/t12-,15-/m1/s1
Reactome pathway
n/an/a 28n/an/an/an/an/an/a
Pfizer Inc.
Curated by ChEMBL
Assay Description
Inhibition of IRAK4 in human PBMC assessed as reduction in R848-stimulated TNF alpha production after 3 hrs
J Med Chem 60: 5521-5542 (2017)
Article DOI: 10.1021/acs.jmedchem.7b00231
BindingDB Entry DOI: 10.7270/Q26D5W42
Interleukin-1 receptor-associated kinase 4
(Homo sapiens (Human))
BDBM50239493
(CHEMBL4103497 | US10329302, Example 312 | US107935...)
Show SMILES CCC[C@@H]1CC(=O)N[C@@H]1COc1nccc2cc(C(N)=O)c(OC)cc12 |r|
Show InChI InChI=1S/C19H23N3O4/c1-3-4-12-8-17(23)22-15(12)10-26-19-13-9-16(25-2)14(18(20)24)7-11(13)5-6-21-19/h5-7,9,12,15H,3-4,8,10H2,1-2H3,(H2,20,24)(H,22,23)/t12-,15-/m1/s1
Reactome pathway
US Patent
n/an/a 1.30n/an/an/an/an/an/a
Pfizer Inc.
US Patent
Assay Description
Protocol B: To begin the assay, 45 μL of reaction mixture containing 20 mM HEPES pH=7.5, 5 mM MgCl2, 0.0025% Brij-35, 600 μM ATP, 228 μ...
US Patent US10793579 (2020)
Interleukin-1 receptor-associated kinase 4
(Homo sapiens (Human))
BDBM50239493
(CHEMBL4103497 | US10329302, Example 312 | US107935...)
Show SMILES CCC[C@@H]1CC(=O)N[C@@H]1COc1nccc2cc(C(N)=O)c(OC)cc12 |r|
Show InChI InChI=1S/C19H23N3O4/c1-3-4-12-8-17(23)22-15(12)10-26-19-13-9-16(25-2)14(18(20)24)7-11(13)5-6-21-19/h5-7,9,12,15H,3-4,8,10H2,1-2H3,(H2,20,24)(H,22,23)/t12-,15-/m1/s1
Reactome pathway
US Patent
n/an/a 1.30n/an/an/an/an/an/a
St. Jude Research Hospital
Assay Description
This is an in vitro assay to measure IRAK4 enzymatic activity utilizing the DELFIA (Dissociation-Enhanced Lanthanide Fluorescent Immunoassay, Perkin-...
ACS Chem Biol 4: 834-43 (2009)
BindingDB Entry DOI: 10.7270/Q2FT8PC5
Interleukin-1 receptor-associated kinase 4
(Homo sapiens (Human))
BDBM50239493
(CHEMBL4103497 | US10329302, Example 312 | US107935...)
Show SMILES CCC[C@@H]1CC(=O)N[C@@H]1COc1nccc2cc(C(N)=O)c(OC)cc12 |r|
Show InChI InChI=1S/C19H23N3O4/c1-3-4-12-8-17(23)22-15(12)10-26-19-13-9-16(25-2)14(18(20)24)7-11(13)5-6-21-19/h5-7,9,12,15H,3-4,8,10H2,1-2H3,(H2,20,24)(H,22,23)/t12-,15-/m1/s1
Reactome pathway
n/an/a 1.30n/an/an/an/an/an/a
Pfizer Inc.
Curated by ChEMBL
Assay Description
Inhibition of N-terminal His6-tagged human full length IRAK4 preincubated for 20 mins followed by biotinylated-AGAGRDKYKTLRQIR substrate addition in ...
J Med Chem 60: 5521-5542 (2017)
Article DOI: 10.1021/acs.jmedchem.7b00231
BindingDB Entry DOI: 10.7270/Q26D5W42