BDBM50239505 CHEMBL4061801::US10329302, Example 248::US10793579, Example 248
SMILES: COc1cc2c(OC[C@H]3NC(=O)[C@H](C)[C@H]3C)nccc2cc1C(N)=O
InChI Key: InChIKey=LJNLHXYPMKVXJQ-GPCCPHFNSA-N
Data: 4 IC50
Activity Spreadsheet -- Enzyme Inhibition Constant Data from BindingDB
Found 4 hits for monomerid = 50239505
Trg + Lig
Ki
nM
ΔG°
kcal/mole
IC50
nM
Kd
nM
EC50/IC50
nM
koff
s-1
kon
M-1s-1
pHTemp
°C
Interleukin-1 receptor-associated kinase 4
(Homo sapiens (Human))
BDBM50239505
(CHEMBL4061801 | US10329302, Example 248 | US107935...)
Show SMILES COc1cc2c(OC[C@H]3NC(=O)[C@H](C)[C@H]3C)nccc2cc1C(N)=O |r|
Show InChI InChI=1S/C18H21N3O4/c1-9-10(2)17(23)21-14(9)8-25-18-12-7-15(24-3)13(16(19)22)6-11(12)4-5-20-18/h4-7,9-10,14H,8H2,1-3H3,(H2,19,22)(H,21,23)/t9-,10-,14-/m1/s1
Reactome pathway
n/an/a 3.70n/an/an/an/an/an/a
Pfizer Inc.
Curated by ChEMBL
Assay Description
Inhibition of N-terminal His6-tagged human full length IRAK4 preincubated for 20 mins followed by biotinylated-AGAGRDKYKTLRQIR substrate addition in ...
J Med Chem 60: 5521-5542 (2017)
Article DOI: 10.1021/acs.jmedchem.7b00231
BindingDB Entry DOI: 10.7270/Q26D5W42
Interleukin-1 receptor-associated kinase 4
(Homo sapiens (Human))
BDBM50239505
(CHEMBL4061801 | US10329302, Example 248 | US107935...)
Show SMILES COc1cc2c(OC[C@H]3NC(=O)[C@H](C)[C@H]3C)nccc2cc1C(N)=O |r|
Show InChI InChI=1S/C18H21N3O4/c1-9-10(2)17(23)21-14(9)8-25-18-12-7-15(24-3)13(16(19)22)6-11(12)4-5-20-18/h4-7,9-10,14H,8H2,1-3H3,(H2,19,22)(H,21,23)/t9-,10-,14-/m1/s1
Reactome pathway
US Patent
n/an/a 3.70n/an/an/an/an/an/a
Pfizer Inc.
US Patent
Assay Description
Protocol B: To begin the assay, 45 μL of reaction mixture containing 20 mM HEPES pH=7.5, 5 mM MgCl2, 0.0025% Brij-35, 600 μM ATP, 228 μ...
US Patent US10793579 (2020)
Interleukin-1 receptor-associated kinase 4
(Homo sapiens (Human))
BDBM50239505
(CHEMBL4061801 | US10329302, Example 248 | US107935...)
Show SMILES COc1cc2c(OC[C@H]3NC(=O)[C@H](C)[C@H]3C)nccc2cc1C(N)=O |r|
Show InChI InChI=1S/C18H21N3O4/c1-9-10(2)17(23)21-14(9)8-25-18-12-7-15(24-3)13(16(19)22)6-11(12)4-5-20-18/h4-7,9-10,14H,8H2,1-3H3,(H2,19,22)(H,21,23)/t9-,10-,14-/m1/s1
Reactome pathway
US Patent
n/an/a 3.70n/an/an/an/an/an/a
St. Jude Research Hospital
Assay Description
This is an in vitro assay to measure IRAK4 enzymatic activity utilizing the DELFIA (Dissociation-Enhanced Lanthanide Fluorescent Immunoassay, Perkin-...
ACS Chem Biol 4: 834-43 (2009)
BindingDB Entry DOI: 10.7270/Q2FT8PC5
Interleukin-1 receptor-associated kinase 4
(Homo sapiens (Human))
BDBM50239505
(CHEMBL4061801 | US10329302, Example 248 | US107935...)
Show SMILES COc1cc2c(OC[C@H]3NC(=O)[C@H](C)[C@H]3C)nccc2cc1C(N)=O |r|
Show InChI InChI=1S/C18H21N3O4/c1-9-10(2)17(23)21-14(9)8-25-18-12-7-15(24-3)13(16(19)22)6-11(12)4-5-20-18/h4-7,9-10,14H,8H2,1-3H3,(H2,19,22)(H,21,23)/t9-,10-,14-/m1/s1
Reactome pathway
n/an/a 87n/an/an/an/an/an/a
Pfizer Inc.
Curated by ChEMBL
Assay Description
Inhibition of IRAK4 in human PBMC assessed as reduction in R848-stimulated TNF alpha production after 3 hrs
J Med Chem 60: 5521-5542 (2017)
Article DOI: 10.1021/acs.jmedchem.7b00231
BindingDB Entry DOI: 10.7270/Q26D5W42