BDBM50239530 CHEMBL4101470
SMILES: Cc1ccccc1S(=O)(=O)N1CCN(CC1)c1ccc(nn1)C(=O)OCc1ccccc1
InChI Key: InChIKey=SPVTWRYOPLQQII-UHFFFAOYSA-N
Data: 1 IC50
Activity Spreadsheet -- Enzyme Inhibition Constant Data from BindingDB
Found 1 hit for monomerid = 50239530
Trg + Lig
Ki
nM
ΔG°
kcal/mole
IC50
nM
Kd
nM
EC50/IC50
nM
koff
s-1
kon
M-1s-1
pHTemp
°C
dCTP pyrophosphatase 1
(Homo sapiens (Human))
BDBM50239530
(CHEMBL4101470)
Show SMILES Cc1ccccc1S(=O)(=O)N1CCN(CC1)c1ccc(nn1)C(=O)OCc1ccccc1
Show InChI InChI=1S/C23H24N4O4S/c1-18-7-5-6-10-21(18)32(29,30)27-15-13-26(14-16-27)22-12-11-20(24-25-22)23(28)31-17-19-8-3-2-4-9-19/h2-12H,13-17H2,1H3
n/an/a 38n/an/an/an/an/an/a
Karolinska Institutet
Curated by ChEMBL
Assay Description
Inhibition of human full length N-terminal His-tagged dCTPase expressed in Escherichia coli BL21(DE3) using dCTP as substrate by HTS-based malachite ...
J Med Chem 60: 4279-4292 (2017)
Article DOI: 10.1021/acs.jmedchem.7b00182
BindingDB Entry DOI: 10.7270/Q22N54F5