BDBM50239628 CHEMBL4102283
SMILES: OC1CN(C1)C(=O)CC1(C2CC3CC1CC(C2)C3O)c1ccc(cc1)-c1ccc(F)cc1
InChI Key: InChIKey=FBTIGDUFOZJGFY-UHFFFAOYSA-N
Data: 2 IC50
PDB links: 1 PDB ID matches this monomer.
Activity Spreadsheet -- Enzyme Inhibition Constant Data from BindingDB
Found 2 hits for monomerid = 50239628
Trg + Lig
Ki
nM
ΔG°
kcal/mole
IC50
nM
Kd
nM
EC50/IC50
nM
koff
s-1
kon
M-1s-1
pHTemp
°C
11-beta-hydroxysteroid dehydrogenase 1
(Homo sapiens (Human))
BDBM50239628
(CHEMBL4102283)
Show SMILES OC1CN(C1)C(=O)CC1(C2CC3CC1CC(C2)C3O)c1ccc(cc1)-c1ccc(F)cc1 |TLB:12:11:8.13.14:16,7:8:16:10.11.17,19:8:10.12.11:14.15.16,THB:18:17:8.13.14:16,12:13:16:10.11.17,17:11:8:14.15.16,17:15:8:10.12.11,7:8:10.12.11:14.15.16,19:8:16:10.11.17,(5.77,-1.2,;6.92,-2.24,;8.46,-2.16,;8.53,-3.7,;7,-3.78,;9.68,-4.73,;9.36,-6.24,;11.15,-4.26,;12.29,-5.3,;13.49,-4.02,;14.82,-4.5,;16.22,-4.16,;15.2,-5.44,;13.79,-4.87,;13.78,-3.28,;14.83,-2.05,;13.48,-2.53,;16.23,-2.63,;17.52,-1.78,;12.27,-6.84,;10.94,-7.58,;10.92,-9.12,;12.24,-9.91,;13.59,-9.14,;13.6,-7.61,;12.23,-11.45,;10.89,-12.21,;10.87,-13.75,;12.2,-14.54,;12.19,-16.08,;13.55,-13.77,;13.56,-12.23,)|
Show InChI InChI=1S/C27H30FNO3/c28-23-7-3-17(4-8-23)16-1-5-20(6-2-16)27(13-25(31)29-14-24(30)15-29)21-9-18-10-22(27)12-19(11-21)26(18)32/h1-8,18-19,21-22,24,26,30,32H,9-15H2
Reactome pathway
n/an/a 0.700n/an/an/an/an/an/a
Bristol-Myers Squibb
Curated by ChEMBL
Assay Description
Inhibitory activity against human plasma renin
J Med Chem 60: 4932-4948 (2017)
Article DOI: 10.1021/acs.jmedchem.7b00211
BindingDB Entry DOI: 10.7270/Q2DV1N23
3D
3D Structure (crystal)
11-beta-hydroxysteroid dehydrogenase 1
(Mus musculus (mouse))
BDBM50239628
(CHEMBL4102283)
Show SMILES OC1CN(C1)C(=O)CC1(C2CC3CC1CC(C2)C3O)c1ccc(cc1)-c1ccc(F)cc1 |TLB:12:11:8.13.14:16,7:8:16:10.11.17,19:8:10.12.11:14.15.16,THB:18:17:8.13.14:16,12:13:16:10.11.17,17:11:8:14.15.16,17:15:8:10.12.11,7:8:10.12.11:14.15.16,19:8:16:10.11.17,(5.77,-1.2,;6.92,-2.24,;8.46,-2.16,;8.53,-3.7,;7,-3.78,;9.68,-4.73,;9.36,-6.24,;11.15,-4.26,;12.29,-5.3,;13.49,-4.02,;14.82,-4.5,;16.22,-4.16,;15.2,-5.44,;13.79,-4.87,;13.78,-3.28,;14.83,-2.05,;13.48,-2.53,;16.23,-2.63,;17.52,-1.78,;12.27,-6.84,;10.94,-7.58,;10.92,-9.12,;12.24,-9.91,;13.59,-9.14,;13.6,-7.61,;12.23,-11.45,;10.89,-12.21,;10.87,-13.75,;12.2,-14.54,;12.19,-16.08,;13.55,-13.77,;13.56,-12.23,)|
Show InChI InChI=1S/C27H30FNO3/c28-23-7-3-17(4-8-23)16-1-5-20(6-2-16)27(13-25(31)29-14-24(30)15-29)21-9-18-10-22(27)12-19(11-21)26(18)32/h1-8,18-19,21-22,24,26,30,32H,9-15H2
Reactome pathway
n/an/a 19n/an/an/an/an/an/a
Bristol-Myers Squibb
Curated by ChEMBL
Assay Description
Inhibition of mouse 11beta-HSD1
J Med Chem 60: 4932-4948 (2017)
Article DOI: 10.1021/acs.jmedchem.7b00211
BindingDB Entry DOI: 10.7270/Q2DV1N23