BDBM50239737 CHEMBL4094814::US10214537, Example 573
SMILES: CC(=O)N1CCN(C(=O)C1(C)C)c1cc(ccc1C(F)(F)F)-c1cc(c2c(N)ncnn12)C(F)(F)F
InChI Key: InChIKey=WZPCAKBVBITGNM-UHFFFAOYSA-N
Data: 4 IC50
Activity Spreadsheet -- Enzyme Inhibition Constant Data from BindingDB
Found 4 hits for monomerid = 50239737
Trg + Lig
Ki
nM
ΔG°
kcal/mole
IC50
nM
Kd
nM
EC50/IC50
nM
koff
s-1
kon
M-1s-1
pHTemp
°C
Phosphatidylinositol 4,5-bisphosphate 3-kinase catalytic subunit delta isoform
(Homo sapiens (Human))
BDBM50239737
(CHEMBL4094814 | US10214537, Example 573)
Show SMILES CC(=O)N1CCN(C(=O)C1(C)C)c1cc(ccc1C(F)(F)F)-c1cc(c2c(N)ncnn12)C(F)(F)F
Show InChI InChI=1S/C22H20F6N6O2/c1-11(35)33-7-6-32(19(36)20(33,2)3)16-8-12(4-5-13(16)21(23,24)25)15-9-14(22(26,27)28)17-18(29)30-10-31-34(15)17/h4-5,8-10H,6-7H2,1-3H3,(H2,29,30,31)
NCI pathway
Reactome pathway
US Patent
n/an/a 2n/an/an/an/an/an/a
Bristol-Myers Squibb Company
US Patent
Assay Description
The ADP-Glo format PI3K assays were performed in Proxiplate 384-well plates (Perkin Elmer #6008280). The final assay volume was 2 μl prepared fr...
US Patent US10214537 (2019)
BindingDB Entry DOI: 10.7270/Q2HH6NB2
Phosphatidylinositol 4,5-bisphosphate 3-kinase catalytic subunit delta isoform
(Homo sapiens (Human))
BDBM50239737
(CHEMBL4094814 | US10214537, Example 573)
Show SMILES CC(=O)N1CCN(C(=O)C1(C)C)c1cc(ccc1C(F)(F)F)-c1cc(c2c(N)ncnn12)C(F)(F)F
Show InChI InChI=1S/C22H20F6N6O2/c1-11(35)33-7-6-32(19(36)20(33,2)3)16-8-12(4-5-13(16)21(23,24)25)15-9-14(22(26,27)28)17-18(29)30-10-31-34(15)17/h4-5,8-10H,6-7H2,1-3H3,(H2,29,30,31)
NCI pathway
Reactome pathway
n/an/a 82n/an/an/an/an/an/a
Bristol-Myers Squibb Company
Curated by ChEMBL
Assay Description
Antisecretory activity evaluated by the inhibition of 14C -AP uptake in isolated rabbit parietal cells stimulated by dibutyryl cyclic adenosine 3', 5...
J Med Chem 60: 5193-5208 (2017)
Article DOI: 10.1021/acs.jmedchem.7b00618
BindingDB Entry DOI: 10.7270/Q2WW7KVJ
Phosphatidylinositol 4,5-bisphosphate 3-kinase catalytic subunit delta isoform
(Homo sapiens (Human))
BDBM50239737
(CHEMBL4094814 | US10214537, Example 573)
Show SMILES CC(=O)N1CCN(C(=O)C1(C)C)c1cc(ccc1C(F)(F)F)-c1cc(c2c(N)ncnn12)C(F)(F)F
Show InChI InChI=1S/C22H20F6N6O2/c1-11(35)33-7-6-32(19(36)20(33,2)3)16-8-12(4-5-13(16)21(23,24)25)15-9-14(22(26,27)28)17-18(29)30-10-31-34(15)17/h4-5,8-10H,6-7H2,1-3H3,(H2,29,30,31)
NCI pathway
Reactome pathway
n/an/a 230n/an/an/an/an/an/a
Bristol-Myers Squibb Company
Curated by ChEMBL
Assay Description
Antisecretory activity evaluated by the inhibition of 14C -AP uptake in isolated rabbit parietal cells stimulated by dibutyryl cyclic adenosine 3', 5...
J Med Chem 60: 5193-5208 (2017)
Article DOI: 10.1021/acs.jmedchem.7b00618
BindingDB Entry DOI: 10.7270/Q2WW7KVJ
Phosphatidylinositol 4,5-bisphosphate 3-kinase catalytic subunit delta isoform
(Homo sapiens (Human))
BDBM50239737
(CHEMBL4094814 | US10214537, Example 573)
Show SMILES CC(=O)N1CCN(C(=O)C1(C)C)c1cc(ccc1C(F)(F)F)-c1cc(c2c(N)ncnn12)C(F)(F)F
Show InChI InChI=1S/C22H20F6N6O2/c1-11(35)33-7-6-32(19(36)20(33,2)3)16-8-12(4-5-13(16)21(23,24)25)15-9-14(22(26,27)28)17-18(29)30-10-31-34(15)17/h4-5,8-10H,6-7H2,1-3H3,(H2,29,30,31)
NCI pathway
Reactome pathway
n/an/a 1.90n/an/an/an/an/an/a
Bristol-Myers Squibb Company
Curated by ChEMBL
Assay Description
Antisecretory activity evaluated by the inhibition of 14C -AP uptake in isolated rabbit parietal cells stimulated by dibutyryl cyclic adenosine 3', 5...
J Med Chem 60: 5193-5208 (2017)
Article DOI: 10.1021/acs.jmedchem.7b00618
BindingDB Entry DOI: 10.7270/Q2WW7KVJ