BDBM50239838 CHEMBL4071586
SMILES: Cn1ncc(-c2nn(C)c3ncnc(N4CCC4)c23)c1-c1ccccc1
InChI Key: InChIKey=GACYMEYQPPXQEM-UHFFFAOYSA-N
Data: 1 IC50
Activity Spreadsheet -- Enzyme Inhibition Constant Data from BindingDB
Found 1 hit for monomerid = 50239838
Trg + Lig
Ki
nM
ΔG°
kcal/mole
IC50
nM
Kd
nM
EC50/IC50
nM
koff
s-1
kon
M-1s-1
pHTemp
°C
Homo sapiens phosphodiesterase 2A (PDE2A)
(Homo sapiens (Human))
BDBM50239838
(CHEMBL4071586)
Show SMILES Cn1ncc(-c2nn(C)c3ncnc(N4CCC4)c23)c1-c1ccccc1
Show InChI InChI=1S/C19H19N7/c1-24-17(13-7-4-3-5-8-13)14(11-22-24)16-15-18(25(2)23-16)20-12-21-19(15)26-9-6-10-26/h3-5,7-8,11-12H,6,9-10H2,1-2H3
n/an/a 189n/an/an/an/an/an/a
Pfizer Inc.
Curated by ChEMBL
Assay Description
Inhibition of full length recombinant human FLAG-tagged PDE2A3 expressed in sf21 cells using [3H]cGMP as substrate by scintillation proximity assay
J Med Chem 60: 5673-5698 (2017)
Article DOI: 10.1021/acs.jmedchem.7b00397
BindingDB Entry DOI: 10.7270/Q2VX0JNT