BDBM50239958 CHEMBL4105299
SMILES: N[C@@H]1CCCC[C@H]1NS(=O)(=O)c1ccc(cc1)-c1ccc(CSc2nc3CCCc3c(=O)[nH]2)cc1
InChI Key: InChIKey=DPPIOMVVZPSRDW-ISKFKSNPSA-N
Data: 6 IC50
Activity Spreadsheet -- Enzyme Inhibition Constant Data from BindingDB
Found 6 hits for monomerid = 50239958
Trg + Lig
Ki
nM
ΔG°
kcal/mole
IC50
nM
Kd
nM
EC50/IC50
nM
koff
s-1
kon
M-1s-1
pHTemp
°C
Collagenase 3
(Homo sapiens (Human))
BDBM50239958
(CHEMBL4105299)
Show SMILES N[C@@H]1CCCC[C@H]1NS(=O)(=O)c1ccc(cc1)-c1ccc(CSc2nc3CCCc3c(=O)[nH]2)cc1 |r|
Show InChI InChI=1S/C26H30N4O3S2/c27-22-5-1-2-6-24(22)30-35(32,33)20-14-12-19(13-15-20)18-10-8-17(9-11-18)16-34-26-28-23-7-3-4-21(23)25(31)29-26/h8-15,22,24,30H,1-7,16,27H2,(H,28,29,31)/t22-,24-/m1/s1
NCI pathway
Reactome pathway
n/an/a 17n/an/an/an/an/an/a
Department of Chemistry, Scripps Florida , 130 Scripps Way, Jupiter, Florida 33458, United States.
Curated by ChEMBL
Assay Description
Inhibition of full length recombinant human MMP13 expressed in mouse NSO cells using fTHP-15 as substrate preincubated for 30 mins followed by substr...
J Med Chem 60: 5816-5825 (2017)
Article DOI: 10.1021/acs.jmedchem.7b00514
BindingDB Entry DOI: 10.7270/Q23F4RTD
Interstitial collagenase
(Homo sapiens (Human))
BDBM50239958
(CHEMBL4105299)
Show SMILES N[C@@H]1CCCC[C@H]1NS(=O)(=O)c1ccc(cc1)-c1ccc(CSc2nc3CCCc3c(=O)[nH]2)cc1 |r|
Show InChI InChI=1S/C26H30N4O3S2/c27-22-5-1-2-6-24(22)30-35(32,33)20-14-12-19(13-15-20)18-10-8-17(9-11-18)16-34-26-28-23-7-3-4-21(23)25(31)29-26/h8-15,22,24,30H,1-7,16,27H2,(H,28,29,31)/t22-,24-/m1/s1
Reactome pathway
n/an/a>1.00E+4n/an/an/an/an/an/a
Department of Chemistry, Scripps Florida , 130 Scripps Way, Jupiter, Florida 33458, United States.
Curated by ChEMBL
Assay Description
Inhibition of recombinant human MMP1 expressed in mouse NSO cells using fTHP-15 as substrate preincubated for 30 mins followed by substrate addition ...
J Med Chem 60: 5816-5825 (2017)
Article DOI: 10.1021/acs.jmedchem.7b00514
BindingDB Entry DOI: 10.7270/Q23F4RTD
72 kDa type IV collagenase
(Homo sapiens (Human))
BDBM50239958
(CHEMBL4105299)
Show SMILES N[C@@H]1CCCC[C@H]1NS(=O)(=O)c1ccc(cc1)-c1ccc(CSc2nc3CCCc3c(=O)[nH]2)cc1 |r|
Show InChI InChI=1S/C26H30N4O3S2/c27-22-5-1-2-6-24(22)30-35(32,33)20-14-12-19(13-15-20)18-10-8-17(9-11-18)16-34-26-28-23-7-3-4-21(23)25(31)29-26/h8-15,22,24,30H,1-7,16,27H2,(H,28,29,31)/t22-,24-/m1/s1
Reactome pathway
n/an/a>1.00E+4n/an/an/an/an/an/a
Department of Chemistry, Scripps Florida , 130 Scripps Way, Jupiter, Florida 33458, United States.
Curated by ChEMBL
Assay Description
Inhibition of recombinant human MMP2 expressed in mouse NSO cells using fTHP-15 as substrate preincubated for 30 mins followed by substrate addition ...
J Med Chem 60: 5816-5825 (2017)
Article DOI: 10.1021/acs.jmedchem.7b00514
BindingDB Entry DOI: 10.7270/Q23F4RTD
Matrix metalloproteinase-9
(Homo sapiens (Human))
BDBM50239958
(CHEMBL4105299)
Show SMILES N[C@@H]1CCCC[C@H]1NS(=O)(=O)c1ccc(cc1)-c1ccc(CSc2nc3CCCc3c(=O)[nH]2)cc1 |r|
Show InChI InChI=1S/C26H30N4O3S2/c27-22-5-1-2-6-24(22)30-35(32,33)20-14-12-19(13-15-20)18-10-8-17(9-11-18)16-34-26-28-23-7-3-4-21(23)25(31)29-26/h8-15,22,24,30H,1-7,16,27H2,(H,28,29,31)/t22-,24-/m1/s1
Reactome pathway
n/an/a>1.00E+4n/an/an/an/an/an/a
Department of Chemistry, Scripps Florida , 130 Scripps Way, Jupiter, Florida 33458, United States.
Curated by ChEMBL
Assay Description
Inhibition of MMP9 (unknown origin) using fTHP-15 as substrate preincubated for 30 mins followed by substrate addition measured immediately by fluore...
J Med Chem 60: 5816-5825 (2017)
Article DOI: 10.1021/acs.jmedchem.7b00514
BindingDB Entry DOI: 10.7270/Q23F4RTD
Matrix metalloproteinase 14
(Homo sapiens (Human))
BDBM50239958
(CHEMBL4105299)
Show SMILES N[C@@H]1CCCC[C@H]1NS(=O)(=O)c1ccc(cc1)-c1ccc(CSc2nc3CCCc3c(=O)[nH]2)cc1 |r|
Show InChI InChI=1S/C26H30N4O3S2/c27-22-5-1-2-6-24(22)30-35(32,33)20-14-12-19(13-15-20)18-10-8-17(9-11-18)16-34-26-28-23-7-3-4-21(23)25(31)29-26/h8-15,22,24,30H,1-7,16,27H2,(H,28,29,31)/t22-,24-/m1/s1
n/an/a>1.00E+4n/an/an/an/an/an/a
Department of Chemistry, Scripps Florida , 130 Scripps Way, Jupiter, Florida 33458, United States.
Curated by ChEMBL
Assay Description
Inhibition of recombinant human MMP14 using fTHP-15 as substrate preincubated for 30 mins followed by substrate addition measured immediately by fluo...
J Med Chem 60: 5816-5825 (2017)
Article DOI: 10.1021/acs.jmedchem.7b00514
BindingDB Entry DOI: 10.7270/Q23F4RTD
Neutrophil collagenase
(Homo sapiens (Human))
BDBM50239958
(CHEMBL4105299)
Show SMILES N[C@@H]1CCCC[C@H]1NS(=O)(=O)c1ccc(cc1)-c1ccc(CSc2nc3CCCc3c(=O)[nH]2)cc1 |r|
Show InChI InChI=1S/C26H30N4O3S2/c27-22-5-1-2-6-24(22)30-35(32,33)20-14-12-19(13-15-20)18-10-8-17(9-11-18)16-34-26-28-23-7-3-4-21(23)25(31)29-26/h8-15,22,24,30H,1-7,16,27H2,(H,28,29,31)/t22-,24-/m1/s1
Reactome pathway
n/an/a>1.00E+4n/an/an/an/an/an/a
Department of Chemistry, Scripps Florida , 130 Scripps Way, Jupiter, Florida 33458, United States.
Curated by ChEMBL
Assay Description
Inhibition of MMP8 (unknown origin) using fTHP-15 as substrate preincubated for 30 mins followed by substrate addition measured immediately by fluore...
J Med Chem 60: 5816-5825 (2017)
Article DOI: 10.1021/acs.jmedchem.7b00514
BindingDB Entry DOI: 10.7270/Q23F4RTD