BDBM50240194 CHEMBL4092157
SMILES: COc1ccc(cc1)N1CCN(Cn2nc(oc2=S)-c2ccc3OCCOc3c2)CC1
InChI Key: InChIKey=BXGHNXVPRWMOKM-UHFFFAOYSA-N
Data: 1 IC50
Activity Spreadsheet -- Enzyme Inhibition Constant Data from BindingDB
Found 1 hit for monomerid = 50240194
Trg + Lig
Ki
nM
ΔG°
kcal/mole
IC50
nM
Kd
nM
EC50/IC50
nM
koff
s-1
kon
M-1s-1
pHTemp
°C
Focal adhesion kinase 1
(Homo sapiens (Human))
BDBM50240194
(CHEMBL4092157)
Show SMILES COc1ccc(cc1)N1CCN(Cn2nc(oc2=S)-c2ccc3OCCOc3c2)CC1
Show InChI InChI=1S/C22H24N4O4S/c1-27-18-5-3-17(4-6-18)25-10-8-24(9-11-25)15-26-22(31)30-21(23-26)16-2-7-19-20(14-16)29-13-12-28-19/h2-7,14H,8-13,15H2,1H3
NCI pathway
Reactome pathway
n/an/a 2.45E+3n/an/an/an/an/an/a
Nanjing University
Curated by ChEMBL
Assay Description
Inhibitory activity was determined against HSV-1 Ribonucleoside diphosphate reductase
Bioorg Med Chem 25: 2593-2600 (2017)
Article DOI: 10.1016/j.bmc.2017.03.038
BindingDB Entry DOI: 10.7270/Q2XP772B