null
SMILES: Clc1ccccc1N1CCN(Cn2nc(oc2=S)-c2ccc3OCCOc3c2)CC1
InChI Key: InChIKey=GDDSZELFQUOACP-UHFFFAOYSA-N
Activity Spreadsheet -- Enzyme Inhibition Constant Data from BindingDB
Found 1 hit for monomerid = 50240202
Trg + Lig
Ki
nM
ΔG°
kcal/mole
IC50
nM
Kd
nM
EC50/IC50
nM
koff
s-1
kon
M-1s-1
pHTemp
°C
Focal adhesion kinase 1
(Homo sapiens (Human))
BDBM50240202
(CHEMBL4096055)
Show SMILES Clc1ccccc1N1CCN(Cn2nc(oc2=S)-c2ccc3OCCOc3c2)CC1
Show InChI InChI=1S/C21H21ClN4O3S/c22-16-3-1-2-4-17(16)25-9-7-24(8-10-25)14-26-21(30)29-20(23-26)15-5-6-18-19(13-15)28-12-11-27-18/h1-6,13H,7-12,14H2
NCI pathway
Reactome pathway
n/an/a 1.16E+3n/an/an/an/an/an/a
Nanjing University
Curated by ChEMBL
Assay Description
Inhibition of FAK (unknown origin) by enzyme immuno assay
Bioorg Med Chem 25: 2593-2600 (2017)
Article DOI: 10.1016/j.bmc.2017.03.038
BindingDB Entry DOI: 10.7270/Q2XP772B