BDBM50240217 CHEMBL4063659
SMILES: CN1CCN(Cc2ccc(cc2C(F)(F)F)C(=O)Nc2ccc(C)c(NC(=O)c3cccc(c3)-c3ccncc3)c2)CC1
InChI Key: InChIKey=ZELLDMQPTIPJQD-UHFFFAOYSA-N
Data: 2 IC50
Activity Spreadsheet -- Enzyme Inhibition Constant Data from BindingDB
Found 2 hits for monomerid = 50240217
Trg + Lig
Ki
nM
ΔG°
kcal/mole
IC50
nM
Kd
nM
EC50/IC50
nM
koff
s-1
kon
M-1s-1
pHTemp
°C
Macrophage colony stimulating factor receptor
(Homo sapiens (Human))
BDBM50240217
(CHEMBL4063659)
Show SMILES CN1CCN(Cc2ccc(cc2C(F)(F)F)C(=O)Nc2ccc(C)c(NC(=O)c3cccc(c3)-c3ccncc3)c2)CC1
Show InChI InChI=1S/C33H32F3N5O2/c1-22-6-9-28(20-30(22)39-32(43)25-5-3-4-24(18-25)23-10-12-37-13-11-23)38-31(42)26-7-8-27(29(19-26)33(34,35)36)21-41-16-14-40(2)15-17-41/h3-13,18-20H,14-17,21H2,1-2H3,(H,38,42)(H,39,43)
n/an/a 10n/an/an/an/an/an/a
Integral BioSciences Pvt. Ltd
Curated by ChEMBL
Assay Description
Inhibition of human CSF1R using poly[Glu:Tyr] (4:1) as substrate incubated for 2 hrs in presence of [33gammaP]ATP by P81 ion exchange chromatographic...
Bioorg Med Chem Lett 27: 2153-2160 (2017)
Article DOI: 10.1016/j.bmcl.2017.03.064
BindingDB Entry DOI: 10.7270/Q2SX6GC2
Mast/stem cell growth factor receptor Kit
(Homo sapiens (Human))
BDBM50240217
(CHEMBL4063659)
Show SMILES CN1CCN(Cc2ccc(cc2C(F)(F)F)C(=O)Nc2ccc(C)c(NC(=O)c3cccc(c3)-c3ccncc3)c2)CC1
Show InChI InChI=1S/C33H32F3N5O2/c1-22-6-9-28(20-30(22)39-32(43)25-5-3-4-24(18-25)23-10-12-37-13-11-23)38-31(42)26-7-8-27(29(19-26)33(34,35)36)21-41-16-14-40(2)15-17-41/h3-13,18-20H,14-17,21H2,1-2H3,(H,38,42)(H,39,43)
n/an/a 390n/an/an/an/an/an/a
Integral BioSciences Pvt. Ltd
Curated by ChEMBL
Assay Description
Inhibition of human c-Kit using poly[Glu:Tyr] (4:1) as substrate measured after 2 hrs in presence of [33gammaP]ATP by P18 ion exchange chromatographi...
Bioorg Med Chem Lett 27: 2153-2160 (2017)
Article DOI: 10.1016/j.bmcl.2017.03.064
BindingDB Entry DOI: 10.7270/Q2SX6GC2